{"text_format":"1","workbook":"xlsx","n_sheets":38,"sheets":["Quadro Síntese","Indicadores I","Indicadores II","Diagrama SÍntese","Gráficos Renda","Gráficos Trabalho","Plan1","Gráficos reciprocidade","MENU","Instruções","Agroecossistema","SUB. 1","SUB. 2","SUB. 3","SUB. 4","SUB. 5","SUB. 6","SUB. 7","SUB. 8","SUB. 9","SUB. 10","SUB. 11","SUB. 12","SUB. Extrativista","Tabelas Dinâmicas 1","TG Grau Merc.","TD ERS","TD ERS para Diagrama","Tabela ERS","Tabela Produções","TD Produções","TDG Conj, Produções","TDG produções","TDG Venda","TDG Autocons.","Tabela Insumos","TD Insumos","TDG Insumos"],"not_rendered":{"charts":42,"images":4,"macros":1,"external_links":0,"defined_names":61,"comments":18,"pivot_tables":18},"unopened":[],"bounds":{"document_bytes":16777216,"sheet_cells":100000,"rows_first":2000,"rows_last":500,"rows_between":2000,"halvings":0,"cell_chars":16384,"cell_head_chars":4096},"cells_cut":0,"cells_raw":0,"read":"whole","date_system":"1900"}

{"sheet":"Quadro Síntese","index":0,"n_rows":60,"n_cols":10,"rows_kept":60,"cut":false,"hidden":false,"merged":[[17,6,17,7],[17,3,17,4],[10,1,10,2],[10,3,10,4],[1,1,1,9],[3,1,3,2],[4,1,4,2],[5,1,5,2],[3,3,3,6],[5,3,5,6],[6,1,6,2],[9,1,9,2],[7,1,8,2],[7,3,8,4],[12,1,13,3],[56,3,56,5],[57,3,57,5],[58,3,58,5],[23,1,23,2],[18,6,18,7],[19,6,19,7],[18,3,18,4],[19,3,19,4],[54,1,56,1],[55,3,55,5],[45,4,45,5],[30,3,30,4],[54,3,54,5],[49,1,50,1],[39,1,40,1],[45,1,46,1],[35,1,35,2],[46,4,46,5],[21,3,21,4],[20,6,20,7],[21,6,21,7],[29,3,29,4],[22,1,22,2],[20,3,20,4],[31,3,31,4],[32,3,32,4],[33,3,33,4],[50,4,50,7],[49,4,49,7],[24,3,24,4],[27,3,27,4],[28,3,28,4]]}
[]
[null,"Quadro síntese do agroecossistema"]
[]
[null,"Família:",null,{"$f":"Agroecossistema!C4","v":"Manoel Inacio/Adenice Vieira"},null,null,null,"Data de Coleta:",{"$f":"Agroecossistema!P8","v":"2016-12-01"}]
[]
[null,"Comunidade:",null,{"$f":"Agroecossistema!C6","v":"Tanque de Pedra / Sitio Balaio"},null,null,null,"Ano Referência:",{"$f":"Agroecossistema!P6","v":"2015-11-01"},{"$f":"Agroecossistema!Q6","v":"2016-11-01"}]
[]
[null,"Município:",null,{"$f":"Agroecossistema!C11","v":"Nossa Senhora do Glória"},null,null,null,"Coordenadas","Latitude:",{"$f":"CONCATENATE(Agroecossistema!D8,\"⁰ \",Agroecossistema!E8,\"'\",Agroecossistema!F8,\"\"\"\")","v":"⁰ '\""}]
[null,null,null,null,null,null,null,null,"Longitude:",{"$f":"CONCATENATE(Agroecossistema!D9,\"⁰ \",Agroecossistema!E9,\"'\",Agroecossistema!F9,\"\"\"\")","v":"⁰ '\""}]
[]
[null,"Estado:",null,{"$f":"Agroecossistema!C12","v":"Sergipe"},null,null,null,"Área:",{"$f":"Agroecossistema!C14","v":7},"hectares"]
[]
[null,"Composição do Núcleo Social de Gestão do Agroecossistema (NSGA):",null,null,{"$f":"Agroecossistema!M20","v":15},"pessoas",{"$f":"Agroecossistema!K20","v":8},"mulher(es)",{"$f":"Agroecossistema!L20","v":7},"homem(s)"]
[null,null,null,null,null,null,{"$f":"Agroecossistema!F20","v":7},"jovens",{"$f":"Agroecossistema!G20","v":6},"jovens"]
[null,null,null,null,null,null,{"$f":"Agroecossistema!H20","v":0},"outras",{"$f":"Agroecossistema!I21","v":0},"outros"]
[null,null,null,null,null,null,null,null,{"$f":"Agroecossistema!J20","v":0},"crianças"]
[]
[null,"Subsistemas","1-",{"$f":"'Indicadores I'!B17","v":"Bovino"},null,"5-",{"$f":"'Indicadores I'!B21","v":"Lavoura Milho e palma"},null,"9-",{"$f":"'Indicadores I'!B25","v":0}]
[null,null,"2-",{"$f":"'Indicadores I'!B18","v":"Suino"},null,"6-",{"$f":"'Indicadores I'!B22","v":"Quintal - frutas e medicinais"},null,"10-",{"$f":"'Indicadores I'!B26","v":0}]
[null,null,"3-",{"$f":"'Indicadores I'!B19","v":"Ovino"},null,"7-",{"$f":"'Indicadores I'!B23","v":0},null,"11-",{"$f":"'Indicadores I'!B27","v":0}]
[null,null,"4-",{"$f":"'Indicadores I'!B20","v":"Aves"},null,"8-",{"$f":"'Indicadores I'!B24","v":0},null,"12-",{"$f":"'Indicadores I'!B28","v":0}]
[null,null,null,null,null,null,null,null,"13-",{"$f":"'Indicadores I'!B29","v":0}]
[]
[]
[null,"Rendas",null,{"$f":"'Indicadores I'!B6","v":"1 - Rendas Agrícolas"},null,{"$f":"'Indicadores I'!C6","v":19850.435997435899},{"$f":"'Indicadores I'!D6","v":0.55743310749874608}]
[null,null,null,"1.1 Monetárias",null,{"$f":"'Indicadores I'!J51","v":12927.569330769231},{"$f":"F26/F25","v":0.65124863415791456}]
[null,null,null,"1.2 Não-monetárias",null,{"$f":"F25-F26","v":6922.8666666666686},{"$f":"F27/F25","v":0.34875136584208538}]
[null,null,null,{"$f":"'Indicadores I'!B9","v":"2 - Rendas Não Agrícolas"},null,{"$f":"'Indicadores I'!C9","v":15760},{"$f":"'Indicadores I'!D9","v":0.44256689250125408}]
[null,null,null,{"$f":"'Indicadores I'!B10","v":"2.1 - Pluriatividade"},null,{"$f":"'Indicadores I'!C10","v":4320},{"$f":"'Indicadores I'!D10","v":0.27411167512690354}]
[null,null,null,{"$f":"'Indicadores I'!B11","v":"2.2 - Transferência de Renda"},null,{"$f":"'Indicadores I'!C11","v":11440},{"$f":"'Indicadores I'!D11","v":0.7258883248730964}]
[null,null,null,{"$f":"'Indicadores I'!B12","v":"3 - Renda Familiar Total"},null,{"$f":"'Indicadores I'!C12","v":35610.435997435896},{"$f":"'Indicadores I'!D12","v":1}]
[null,null,null,"4 - Renda Total per capita",null,{"$f":"F31/E13/12","v":197.83575554131053}]
[null,null,null,"5 - Renda Monetária per capita",null,{"$f":"(F28+'Indicadores I'!J51)/E13/12","v":159.37538517094018}]
[null,null,null,"6 - Renda Agrícola Monetária per capita",null,{"$f":"'Indicadores I'!J51/E13/12","v":71.81982961538462}]
[]
[null,"Renda Agrícola/ha",null,{"$f":"'Indicadores I'!I51","v":2835.7765567765568}]
[]
[null,"Valor Agregado/ha",null,{"$f":"'Indicadores I'!H51","v":3058.6336996337004}]
[]
[null,"Composição Produto Bruto",null,{"$f":"'Indicadores I'!D31","v":18656.800100000004},"Venda"]
[null,null,"+",{"$f":"'Indicadores I'!E31","v":4410.2},"Autoconsumo"]
[null,null,"+",{"$f":"'Indicadores I'!F31","v":2512.6666666666665},"Trocas e Doações"]
[null,null,"+",{"$f":"'Indicadores I'!G31","v":15283.557692307693},"Estoque"]
[null,null,null,{"$f":"'Indicadores I'!H31","v":40863.224458974357}]
[]
[null,"Renda Bruta - Composição 1",null,{"$f":"'Indicadores I'!D51","v":21410.435997435903},"Valor Agregado"]
[null,null,"+",{"$f":"'Indicadores I'!K31","v":4169.2307692307695},"Consumos Intermediários"]
[null,null,null,{"$f":"SUM(D46:D47)","v":25579.666766666673}]
[]
[null,"Renda Bruta - Composição 2",null,{"$f":"'Indicadores I'!D51+'Indicadores I'!I31","v":23730.435997435903},"Valor Agregado Territorial"]
[null,null,"+",{"$f":"'Indicadores I'!J31","v":1849.2307692307693},"Consumos Intermediários Fora do Território"]
[null,null,null,{"$f":"SUM(D50:D51)","v":25579.666766666673}]
[]
[null,null,null,null,null,null,"Mulheres","Homens","Jovens"]
[null,"Repartição do Valor Agregado por Esfera de Trabalho",null,{"$f":"'Indicadores II'!B39","v":"Mercantil e Autoconsumo"},null,null,{"$f":"'Indicadores II'!I39","v":5951.25582704321},{"$f":"'Indicadores II'!J39","v":8950.4306203025299},{"$f":"'Indicadores II'!E39+'Indicadores II'!F39","v":2084.3349101162476}]
[null,null,null,{"$f":"'Indicadores II'!B40","v":"Doméstico e de Cuidados"},null,null,{"$f":"'Indicadores II'!I40","v":8912.9300340535774},{"$f":"'Indicadores II'!J40","v":334.88895626972345},{"$f":"'Indicadores II'!E40+'Indicadores II'!F40","v":3819.8271574515329}]
[null,null,null,{"$f":"'Indicadores II'!B41","v":"Participação Social"},null,null,{"$f":"'Indicadores II'!I41","v":20.930559766857716},{"$f":"'Indicadores II'!J41","v":0},{"$f":"'Indicadores II'!E41+'Indicadores II'!F41","v":0}]
[null,null,null,{"$f":"'Indicadores II'!B42","v":"Pluriatividade"},null,null,{"$f":"'Indicadores II'!I42","v":0},{"$f":"'Indicadores II'!J42","v":0},{"$f":"'Indicadores II'!E42+'Indicadores II'!F42","v":0}]
[null,null,null,{"$f":"'Indicadores II'!B43","v":"Total (B)"},null,null,{"$f":"'Indicadores II'!I43","v":14885.116420863646},{"$f":"'Indicadores II'!J43","v":9285.3195765722539},{"$f":"'Indicadores II'!E43+'Indicadores II'!F43","v":5904.1620675677805}]
[null,null,null,null,null,null,{"$f":"G59/(G59+H59)","v":0.61583979794335197},{"$f":"H59/(H59+G59)","v":0.38416020205664803},{"$f":"I59/(G59+H59)","v":0.24427205484394732}]

{"sheet":"Indicadores I","index":1,"n_rows":89,"n_cols":19,"rows_kept":89,"cut":false,"hidden":false,"merged":[[48,7,48,8],[33,13,35,13],[33,2,35,2],[33,1,35,1],[32,1,32,13],[33,11,35,11],[13,8,13,14],[14,5,15,5],[33,5,35,5],[33,15,35,15],[14,6,15,6],[33,12,35,12],[14,8,14,10],[33,9,35,9],[33,8,35,8],[14,11,14,13],[14,7,15,7],[72,6,74,6],[53,6,55,6],[72,4,74,4],[72,5,74,5],[72,2,74,2],[53,2,55,2],[53,5,55,5],[72,3,74,3],[53,3,55,3],[53,4,55,4],[72,18,74,18],[53,8,55,8],[53,11,55,11],[53,12,55,12],[53,13,55,13],[72,7,73,10],[72,16,74,16],[72,17,74,17],[53,14,55,14],[53,9,55,9],[72,15,74,15],[72,11,73,14],[71,1,71,10],[72,1,74,1],[53,7,55,7],[53,1,55,1],[1,1,1,14],[33,10,35,10],[53,10,55,10],[13,2,15,2],[13,3,13,7],[33,3,35,3],[14,3,15,3],[33,7,35,7],[4,8,4,9],[5,8,5,9],[6,8,6,9],[7,8,7,9],[8,8,8,9],[4,10,4,11],[5,10,5,11],[33,6,35,6],[52,1,52,10],[12,1,12,7],[3,1,3,3],[3,8,3,14],[6,10,6,11],[7,10,7,11],[8,10,8,11],[4,12,4,13],[5,12,5,13],[6,12,6,13],[7,12,7,13],[8,12,8,13],[33,14,35,14],[33,4,35,4],[13,1,15,1],[14,4,15,4]]}
[]
[null,"INDICADORES ECONÔMICOS"]
[]
[null,"Tabela 01: Composição da renda do NSGA em valores absolutos e relativos",null,null,null,null,null,null,"Tabela 02: Síntese do inventário patrimonial"]
[null,"Rendas","Valor (R$)","%",null,null,null,null,"Inventário Patrimonial  (Capital Agrário)",null,"Início do Período",null,"Final do Período",null,"Variação"]
[null,"1 - Rendas Agrícolas",{"$f":"F51","v":19850.435997435899},{"$f":"IF(C12=0,\"\",C6/C12)","v":0.55743310749874608},null,null,null,null,"Capital Fundiário",null,{"$f":"Agroecossistema!G66","v":131314},null,{"$f":"Agroecossistema!J66","v":131314},null,{"$f":"Agroecossistema!L66","v":0}]
[null,"1.1 Produções Vegetais  e Animais",{"$f":"SUM(F37:F48)-(N30*D7)","v":19850.435901773155},{"$f":"IF(E8=0,\"\",E7/(E7+E8))","v":0.99999999518082405},{"$f":"SUM(F37:F48)","v":20750.435897435898},null,null,null,"Capital Fixo - Equipamentos",null,{"$f":"Agroecossistema!G81","v":3400},null,{"$f":"Agroecossistema!J81","v":3400},null,{"$f":"Agroecossistema!L81","v":0}]
[null,"1.2 Extrativismo",{"$f":"F49-(N30*D8)","v":9.5662741736553342E-5},{"$f":"IF(E7=0,\"\",E8/(E8+E7))","v":4.8191758482740726E-9},{"$f":"F49","v":1E-4},null,null,null,"Capital Fixo - Vivo",null,{"$f":"Agroecossistema!G102","v":13874},null,{"$f":"Agroecossistema!J102","v":13074},null,{"$f":"Agroecossistema!L102","v":-800}]
[null,"2 - Rendas Não Agrícolas",{"$f":"Agroecossistema!K45","v":15760},{"$f":"IF(C12=0,\"\",C9/C12)","v":0.44256689250125408},null,null,null,null,"Total ",null,{"$f":"Agroecossistema!G103","v":148588},null,{"$f":"Agroecossistema!J103","v":147788},null,{"$f":"Agroecossistema!L103","v":-800}]
[null,"2.1 - Pluriatividade",{"$f":"Agroecossistema!K33","v":4320},{"$f":"IF(C10=0,\"\",C10/(C11+C10))","v":0.27411167512690354}]
[null,"2.2 - Transferência de Renda",{"$f":"Agroecossistema!K39","v":11440},{"$f":"IF(C11=0,\"\",C11/(C10+C11))","v":0.7258883248730964}]
[null,"3 - Renda Familiar Total",{"$f":"C6+C9","v":35610.435997435896},{"$f":"IF(C12=0,\"\",C12/C12)","v":1}]
[null,"Tabela 03: Produto Bruto e Custos de Produção do Agroecossistema e de seus Subsistemas"]
[null,"Subsistema ","Área","Produto Bruto (PB)",null,null,null,null,"Custos de Produção (CP)"]
[null,null,null,"Venda \nRenda Bruta Monetária (RBM)","Autoconsumo","Trocas e Doações","Estoque","Total","Consumos Intermediários (CI)",null,null,"Pagamentos a Terceiros (PT)",null,null,"Total                                 CP"]
[null,null,null,null,null,null,null,null,"T","F","Total CI","T","F","Total PT"]
[null,{"$f":"'SUB. 1'!D6","v":"Bovino"},{"$f":"'SUB. 1'!C$8","v":4.54},{"$f":"'SUB. 1'!H37","v":10236.800000000001},{"$f":"'SUB. 1'!J37","v":211.20000000000002},{"$f":"'SUB. 1'!L37","v":220.00000000000003},{"$f":"'SUB. 1'!N37","v":7692.3076923076933},{"$f":"SUM(D17:G17)","v":18360.307692307695},{"$f":"'SUB. 1'!H$80","v":1800},{"$f":"'SUB. 1'!H$81","v":360},{"$f":"'SUB. 1'!H$82","v":2160},{"$f":"'SUB. 1'!H$101","v":0},{"$f":"'SUB. 1'!H$102","v":0},{"$f":"'SUB. 1'!H$103","v":0},{"$f":"K17+N17","v":2160}]
[null,{"$f":"'SUB. 2'!D6","v":"Suino"},{"$f":"'SUB. 2'!C$8","v":0.01},{"$f":"'SUB. 2'!H37","v":7830},{"$f":"'SUB. 2'!J37","v":900},{"$f":"'SUB. 2'!L37","v":1500},{"$f":"'SUB. 2'!N37","v":6600},16830,{"$f":"'SUB. 2'!H$80","v":160},{"$f":"'SUB. 2'!H$81","v":960},{"$f":"'SUB. 2'!H$82","v":1120},{"$f":"'SUB. 2'!H$101","v":0},{"$f":"'SUB. 2'!H$102","v":0},{"$f":"'SUB. 2'!H$103","v":0},1120]
[null,{"$f":"'SUB. 3'!D6","v":"Ovino"},{"$f":"'SUB. 3'!C$8","v":4.54},{"$f":"'SUB. 3'!H37","v":180},{"$f":"'SUB. 3'!J37","v":0},{"$f":"'SUB. 3'!L37","v":0},{"$f":"'SUB. 3'!N37","v":225},405,{"$f":"'SUB. 3'!H$80","v":0},{"$f":"'SUB. 3'!H$81","v":0},{"$f":"'SUB. 3'!H$82","v":0},{"$f":"'SUB. 3'!H$101","v":0},{"$f":"'SUB. 3'!H$102","v":0},{"$f":"'SUB. 3'!H$103","v":0},0]
[null,{"$f":"'SUB. 4'!D6","v":"Aves"},{"$f":"'SUB. 4'!C$8","v":4.54},{"$f":"'SUB. 4'!H37","v":210},{"$f":"'SUB. 4'!J37","v":1980},{"$f":"'SUB. 4'!L37","v":376.66666666666669},{"$f":"'SUB. 4'!N37","v":766.25},3332.9166666666665,{"$f":"'SUB. 4'!H$80","v":0},{"$f":"'SUB. 4'!H$81","v":369.23076923076923},{"$f":"'SUB. 4'!H$82","v":369.23076923076923},{"$f":"'SUB. 4'!H$101","v":0},{"$f":"'SUB. 4'!H$102","v":0},{"$f":"'SUB. 4'!H$103","v":0},369.23076923076923]
[null,{"$f":"'SUB. 5'!D6","v":"Lavoura Milho e palma"},{"$f":"'SUB. 5'!C$8","v":1},{"$f":"'SUB. 5'!H37","v":200},{"$f":"'SUB. 5'!J37","v":50},{"$f":"'SUB. 5'!L37","v":20},{"$f":"'SUB. 5'!N37","v":0},270,{"$f":"'SUB. 5'!H$80","v":360},{"$f":"'SUB. 5'!H$81","v":160},{"$f":"'SUB. 5'!H$82","v":520},{"$f":"'SUB. 5'!H$101","v":0},{"$f":"'SUB. 5'!H$102","v":0},{"$f":"'SUB. 5'!H$103","v":660},1180]
[null,{"$f":"'SUB. 6'!D6","v":"Quintal - frutas e medicinais"},{"$f":"'SUB. 6'!C$8","v":0.16},{"$f":"'SUB. 6'!H37","v":0},{"$f":"'SUB. 6'!J37","v":1269},{"$f":"'SUB. 6'!L37","v":396},{"$f":"'SUB. 6'!N37","v":0},1665,{"$f":"'SUB. 6'!H$80","v":0},{"$f":"'SUB. 6'!H$81","v":0},{"$f":"'SUB. 6'!H$82","v":0},{"$f":"'SUB. 6'!H$101","v":0},{"$f":"'SUB. 6'!H$102","v":0},{"$f":"'SUB. 6'!H$103","v":0},0]
[null,{"$f":"'SUB. 7'!D6","v":0},{"$f":"'SUB. 7'!C$8","v":0},{"$f":"'SUB. 7'!H37","v":0},{"$f":"'SUB. 7'!J37","v":0},{"$f":"'SUB. 7'!L37","v":0},{"$f":"'SUB. 7'!N37","v":0},0,{"$f":"'SUB. 7'!H$80","v":0},{"$f":"'SUB. 7'!H$81","v":0},{"$f":"'SUB. 7'!H$82","v":0},{"$f":"'SUB. 7'!H$101","v":0},{"$f":"'SUB. 7'!H$102","v":0},{"$f":"'SUB. 7'!H$103","v":0},0]
[null,{"$f":"'SUB. 8'!D6","v":0},{"$f":"'SUB. 8'!C$8","v":0},{"$f":"'SUB. 8'!H37","v":0},{"$f":"'SUB. 8'!J37","v":0},{"$f":"'SUB. 8'!L37","v":0},{"$f":"'SUB. 8'!N37","v":0},0,{"$f":"'SUB. 8'!H$80","v":0},{"$f":"'SUB. 8'!H$81","v":0},{"$f":"'SUB. 8'!H$82","v":0},{"$f":"'SUB. 8'!H$101","v":0},{"$f":"'SUB. 8'!H$102","v":0},{"$f":"'SUB. 8'!H$103","v":0},0]
[null,{"$f":"'SUB. 9'!D6","v":0},{"$f":"'SUB. 9'!C$8","v":0},{"$f":"'SUB. 9'!H37","v":0},{"$f":"'SUB. 9'!J37","v":0},{"$f":"'SUB. 9'!L37","v":0},{"$f":"'SUB. 9'!N37","v":0},0,{"$f":"'SUB. 9'!H$80","v":0},{"$f":"'SUB. 9'!H$81","v":0},{"$f":"'SUB. 9'!H$82","v":0},{"$f":"'SUB. 9'!H$101","v":0},{"$f":"'SUB. 9'!H$102","v":0},{"$f":"'SUB. 9'!H$103","v":0},0]
[null,{"$f":"'SUB. 10'!D6","v":0},{"$f":"'SUB. 10'!C$8","v":0},{"$f":"'SUB. 10'!H37","v":0},{"$f":"'SUB. 10'!J37","v":0},{"$f":"'SUB. 10'!L37","v":0},{"$f":"'SUB. 10'!N37","v":0},0,{"$f":"'SUB. 10'!H$80","v":0},{"$f":"'SUB. 10'!H$81","v":0},{"$f":"'SUB. 10'!H$82","v":0},{"$f":"'SUB. 10'!H$101","v":0},{"$f":"'SUB. 10'!H$102","v":0},{"$f":"'SUB. 10'!H$103","v":0},0]
[null,{"$f":"'SUB. 11'!D6","v":0},{"$f":"'SUB. 11'!C$8","v":0},{"$f":"'SUB. 11'!H37","v":0},{"$f":"'SUB. 11'!J37","v":0},{"$f":"'SUB. 11'!L37","v":0},{"$f":"'SUB. 11'!N37","v":0},0,{"$f":"'SUB. 11'!H$80","v":0},{"$f":"'SUB. 11'!H$81","v":0},{"$f":"'SUB. 11'!H$82","v":0},{"$f":"'SUB. 11'!H$101","v":0},{"$f":"'SUB. 11'!H$102","v":0},{"$f":"'SUB. 11'!H$103","v":0},0]
[null,{"$f":"'SUB. 12'!D6","v":0},{"$f":"'SUB. 12'!C$8","v":0},{"$f":"'SUB. 12'!H37","v":0},{"$f":"'SUB. 12'!J37","v":0},{"$f":"'SUB. 12'!L37","v":0},{"$f":"'SUB. 12'!N37","v":0},0,{"$f":"'SUB. 12'!H$80","v":0},{"$f":"'SUB. 12'!H$81","v":0},{"$f":"'SUB. 12'!H$82","v":0},{"$f":"'SUB. 12'!H$101","v":0},{"$f":"'SUB. 12'!H$102","v":0},{"$f":"'SUB. 12'!H$103","v":0},0]
[null,{"$f":"'SUB. Extrativista'!D6","v":0},{"$f":"'SUB. Extrativista'!C$8","v":0},{"$f":"'SUB. Extrativista'!H37","v":1E-4},{"$f":"'SUB. Extrativista'!J37","v":0},{"$f":"'SUB. Extrativista'!L37","v":0},{"$f":"'SUB. Extrativista'!N37","v":0},1E-4,{"$f":"'SUB. Extrativista'!H$80","v":0},{"$f":"'SUB. Extrativista'!H$81","v":0},{"$f":"'SUB. Extrativista'!H$82","v":0},{"$f":"'SUB. Extrativista'!H$101","v":0},{"$f":"'SUB. Extrativista'!H$102","v":0},{"$f":"'SUB. Extrativista'!H$103","v":0},0]
[null,"Custos Sistêmicos",null,null,null,null,null,null,null,null,null,null,null,{"$f":"Agroecossistema!G122","v":900},{"$f":"N30","v":900}]
[null,"Agroecossistema",{"$f":"Agroecossistema!C14","v":7},{"$f":"SUM(D17:D29)","v":18656.800100000004},4410.2,2512.6666666666665,15283.557692307693,40863.224458974357,2320,1849.2307692307693,4169.2307692307695,0,0,{"$f":"SUM(N17:N30)","v":1560},{"$f":"SUM(O17:O30)","v":5729.2307692307695}]
[]
[null,"Tabela 04: Indicadores econômicos do Agroecossistema e de seus Subsistemas"]
[null,"Subsistema ","Renda Bruta       (RB)","Valor Agregado (VA)","Valor Agregado Territorial (VAT)","Renda Agrícola (RA)","Apropriação do Valor Agregado (RA/VAx100)","Produtividade da Terra    (VA/ ha)","Renda Agrícola / ha.","Renda Agrícola Monetária (RAM)","Rentabil. Monetária (RAM/CP)","Rentabil. Monetária Bruta (RBM/CP)","Índice de Rentabilidade Total (VA/CI)","Índice de Endogeneidade (VA/RB)","Índice de Mercantilização (CP/CPT)"]
[]
[]
[null,{"$f":"B17","v":"Bovino"},{"$f":"D17+E17+F17","v":10668.000000000002},{"$f":"C37-K17","v":8508.0000000000018},{"$f":"C37-J17","v":10308.000000000002},{"$f":"D37-N17","v":8508.0000000000018},{"$f":"IF(D37=0,\"\",F37/D37)","v":1},{"$f":"IF(D37=0,\"\",D37/C17)","v":1874.0088105726877},{"$f":"IF(F37=0,\"\",F37/C17)","v":1874.0088105726877},{"$f":"D17-O17","v":8076.8000000000011},{"$f":"IF(O17=0,\"\",J37/O17)","v":3.7392592592592599},{"$f":"IF(O17=0,\"\",D17/O17)","v":4.7392592592592599},{"$f":"IF(O17=0,\"\",D37/O17)","v":3.9388888888888896},{"$f":"IF(D37=0,\"\",D37/C37)","v":0.79752530933633303},{"$f":"IF('SUB. 1'!$H$82+'SUB. 1'!$H$103=0,\"\",('SUB. 1'!$H$82+'SUB. 1'!$H$103)/('SUB. 1'!$H$82+'SUB. 1'!$H$57+'SUB. 1'!$H$103+'SUB. 1'!$H$122))","v":0.21818181818181817}]
[null,"Suino",10230,9110,9270,9110,1,911000,911000,6710,5.9910714285714288,{"$f":"IF(O18=0,\"\",D18/O18)","v":6.9910714285714288},8.1339285714285712,0.89051808406647115,{"$f":"IF('SUB. 2'!$H$82+'SUB. 2'!$H$103=0,\"\",('SUB. 2'!$H$82+'SUB. 2'!$H$103)/('SUB. 2'!$H$82+'SUB. 2'!$H$57+'SUB. 2'!$H$103+'SUB. 2'!$H$122))","v":0.38030560271646857}]
[null,"Ovino",180,180,180,180,1,39.647577092511014,39.647577092511014,180,"","","",1,{"$f":"IF('SUB. 3'!$H$82+'SUB. 3'!$H$103=0,\"\",('SUB. 3'!$H$82+'SUB. 3'!$H$103)/('SUB. 3'!$H$82+'SUB. 3'!$H$57+'SUB. 3'!$H$103+'SUB. 3'!$H$122))","v":""}]
[null,"Aves",2566.6666666666665,2197.4358974358975,2197.4358974358975,2197.4358974358975,1,484.0167174968937,484.0167174968937,-159.23076923076923,-0.43124999999999997,0.56874999999999998,5.9513888888888893,0.85614385614385624,{"$f":"IF('SUB. 4'!$H$82+'SUB. 4'!$H$103=0,\"\",('SUB. 4'!$H$82+'SUB. 4'!$H$103)/('SUB. 4'!$H$82+'SUB. 4'!$H$57+'SUB. 4'!$H$103+'SUB. 4'!$H$122))","v":1}]
[null,"Lavoura Milho e palma",270,-250,110,-910,3.64,-250,-910,-980,-0.83050847457627119,0.16949152542372881,-0.21186440677966101,-0.92592592592592593,{"$f":"IF('SUB. 5'!$H$82+'SUB. 5'!$H$103=0,\"\",('SUB. 5'!$H$82+'SUB. 5'!$H$103)/('SUB. 5'!$H$82+'SUB. 5'!$H$57+'SUB. 5'!$H$103+'SUB. 5'!$H$122))","v":0.94931617055510864}]
[null,"Quintal - frutas e medicinais",1665,1665,1665,1665,1,10406.25,10406.25,0,"","","",1,{"$f":"IF('SUB. 6'!$H$82+'SUB. 6'!$H$103=0,\"\",('SUB. 6'!$H$82+'SUB. 6'!$H$103)/('SUB. 6'!$H$82+'SUB. 6'!$H$57+'SUB. 6'!$H$103+'SUB. 6'!$H$122))","v":""}]
[null,0,0,0,0,0,"","","",0,"","","","",{"$f":"IF('SUB. 7'!$H$82+'SUB. 7'!$H$103=0,\"\",('SUB. 7'!$H$82+'SUB. 7'!$H$103)/('SUB. 7'!$H$82+'SUB. 7'!$H$57+'SUB. 7'!$H$103+'SUB. 7'!$H$122))","v":""}]
[null,0,0,0,0,0,"","","",0,"","","","",{"$f":"IF('SUB. 8'!$H$82+'SUB. 8'!$H$103=0,\"\",('SUB. 8'!$H$82+'SUB. 8'!$H$103)/('SUB. 8'!$H$82+'SUB. 8'!$H$57+'SUB. 8'!$H$103+'SUB. 8'!$H$122))","v":""}]
[null,0,0,0,0,0,"","","",0,"","","","",{"$f":"IF('SUB. 9'!$H$82+'SUB. 9'!$H$103=0,\"\",('SUB. 9'!$H$82+'SUB. 9'!$H$103)/('SUB. 9'!$H$82+'SUB. 9'!$H$57+'SUB. 9'!$H$103+'SUB. 9'!$H$122))","v":""}]
[null,0,0,0,0,0,"","","",0,"","","","",{"$f":"IF('SUB. 10'!$H$82+'SUB. 10'!$H$103=0,\"\",('SUB. 10'!$H$82+'SUB. 10'!$H$103)/('SUB. 10'!$H$82+'SUB. 10'!$H$57+'SUB. 10'!$H$103+'SUB. 10'!$H$122))","v":""}]
[null,0,0,0,0,0,"","","",0,"","","","",{"$f":"IF('SUB. 11'!$H$82+'SUB. 11'!$H$103=0,\"\",('SUB. 11'!$H$82+'SUB. 11'!$H$103)/('SUB. 11'!$H$82+'SUB. 11'!$H$57+'SUB. 11'!$H$103+'SUB. 11'!$H$122))","v":""}]
[null,0,0,0,0,0,"","","",0,"","","","",{"$f":"IF('SUB. 12'!$H$82+'SUB. 12'!$H$103=0,\"\",('SUB. 12'!$H$82+'SUB. 12'!$H$103)/('SUB. 12'!$H$82+'SUB. 12'!$H$57+'SUB. 12'!$H$103+'SUB. 12'!$H$122))","v":""}]
[null,0,1E-4,1E-4,1E-4,1E-4,1,null,null,1E-4,"","","",1,{"$f":"IF('SUB. Extrativista'!$H$82+'SUB. Extrativista'!$H$103=0,\"\",('SUB. Extrativista'!$H$82+'SUB. Extrativista'!$H$103)/('SUB. Extrativista'!$H$82+'SUB. Extrativista'!$H$57+'SUB. Extrativista'!$H$103+'SUB. Extrativista'!$H$122))","v":""}]
[null,"Custos Sistêmicos",null,null,null,{"$f":"-N30","v":-900},{"$f":"IF(D50=0,\"\",D50/C50)","v":""},null,null,{"$f":"-N30","v":-900}]
[null,"Agroecossistema",{"$f":"D31+E31+F31","v":25579.666766666673},{"$f":"C51-K31","v":21410.435997435903},{"$f":"C51-J31","v":23730.435997435903},{"$f":"SUM(F37:F50)","v":19850.435997435899},0.92713833570755733,{"$f":"IF(D51=0,\"\",(D51-D49)/C31)","v":3058.6336996337004},{"$f":"IF(Agroecossistema!C14=0,\"\",(F51-F49)/C31)","v":2835.7765567765568},{"$f":"SUM(J37:J50)","v":12927.569330769231},{"$f":"IF(O31=0,\"\",J51/O31)","v":2.2564232183136412},{"$f":"IF(O31=0,\"\",D31/O31)","v":3.2564232183136417},{"$f":"IF(O31=0,\"\",D51/O31)","v":3.7370524700143224},{"$f":"IF(D51=0,\"\",D51/C51)","v":0.83700996548306217},{"$f":"'Diagrama SÍntese'!$I$24","v":0.32487968590310923}]
[]
[null,"Tabela 05: Número de Horas Trabalhadas no Agroecossistema e nos seus Subsistemas segundo os diferentes segmentos do NSGA"]
[null,"Subsistema ","HT Total","HT Mulher","HT Homem","HT Jovens Mulheres","HT Jovens Homens","HT Outras","HT Outros","HT Total Mulheres","HT Total Homens"]
[]
[]
[null,{"$f":"B37","v":"Bovino"},{"$f":"'SUB. 1'!K$14","v":3368.25},{"$f":"'SUB. 1'!C$14","v":182.5},{"$f":"'SUB. 1'!D$14","v":2555},{"$f":"'SUB. 1'!E$14","v":342.75},{"$f":"'SUB. 1'!F$14","v":288},{"$f":"'SUB. 1'!G$14","v":0},{"$f":"'SUB. 1'!H$14","v":0},{"$f":"'SUB. 1'!I$14","v":525.25},{"$f":"'SUB. 1'!J$14","v":2843}]
[null,"Suino",{"$f":"'SUB. 2'!K$14","v":451.25},{"$f":"'SUB. 2'!C$14","v":180},{"$f":"'SUB. 2'!D$14","v":180},{"$f":"'SUB. 2'!E$14","v":91.25},{"$f":"'SUB. 2'!F$14","v":0},{"$f":"'SUB. 2'!G$14","v":0},{"$f":"'SUB. 2'!H$14","v":0},{"$f":"'SUB. 2'!I$14","v":271.25},{"$f":"'SUB. 2'!J$14","v":180}]
[null,"Ovino",{"$f":"'SUB. 3'!K$14","v":456.25},{"$f":"'SUB. 3'!C$14","v":182.5},{"$f":"'SUB. 3'!D$14","v":182.5},{"$f":"'SUB. 3'!E$14","v":91.25},{"$f":"'SUB. 3'!F$14","v":0},{"$f":"'SUB. 3'!G$14","v":0},{"$f":"'SUB. 3'!H$14","v":0},{"$f":"'SUB. 3'!I$14","v":273.75},{"$f":"'SUB. 3'!J$14","v":182.5}]
[null,"Aves",{"$f":"'SUB. 4'!K$14","v":456.25},{"$f":"'SUB. 4'!C$14","v":365},{"$f":"'SUB. 4'!D$14","v":0},{"$f":"'SUB. 4'!E$14","v":91.25},{"$f":"'SUB. 4'!F$14","v":0},{"$f":"'SUB. 4'!G$14","v":0},{"$f":"'SUB. 4'!H$14","v":0},{"$f":"'SUB. 4'!I$14","v":456.25},{"$f":"'SUB. 4'!J$14","v":0}]
[null,"Lavoura Milho e palma",{"$f":"'SUB. 5'!K$14","v":3367.5},{"$f":"'SUB. 5'!C$14","v":1230},{"$f":"'SUB. 5'!D$14","v":1920},{"$f":"'SUB. 5'!E$14","v":217.5},{"$f":"'SUB. 5'!F$14","v":0},{"$f":"'SUB. 5'!G$14","v":0},{"$f":"'SUB. 5'!H$14","v":0},{"$f":"'SUB. 5'!I$14","v":1447.5},{"$f":"'SUB. 5'!J$14","v":1920}]
[null,"Quintal - frutas e medicinais",{"$f":"'SUB. 6'!K$14","v":444},{"$f":"'SUB. 6'!C$14","v":365},{"$f":"'SUB. 6'!D$14","v":6},{"$f":"'SUB. 6'!E$14","v":73},{"$f":"'SUB. 6'!F$14","v":0},{"$f":"'SUB. 6'!G$14","v":0},{"$f":"'SUB. 6'!H$14","v":0},{"$f":"'SUB. 6'!I$14","v":438},{"$f":"'SUB. 6'!J$14","v":6}]
[null,0,{"$f":"'SUB. 7'!K$14","v":0},{"$f":"'SUB. 7'!C$14","v":0},{"$f":"'SUB. 7'!D$14","v":0},{"$f":"'SUB. 7'!E$14","v":0},{"$f":"'SUB. 7'!F$14","v":0},{"$f":"'SUB. 7'!G$14","v":0},{"$f":"'SUB. 7'!H$14","v":0},{"$f":"'SUB. 7'!I$14","v":0},{"$f":"'SUB. 7'!J$14","v":0}]
[null,0,{"$f":"'SUB. 8'!K$14","v":0},{"$f":"'SUB. 8'!C$14","v":0},{"$f":"'SUB. 8'!D$14","v":0},{"$f":"'SUB. 8'!E$14","v":0},{"$f":"'SUB. 8'!F$14","v":0},{"$f":"'SUB. 8'!G$14","v":0},{"$f":"'SUB. 8'!H$14","v":0},{"$f":"'SUB. 8'!I$14","v":0},{"$f":"'SUB. 8'!J$14","v":0}]
[null,0,{"$f":"'SUB. 9'!K$14","v":0},{"$f":"'SUB. 9'!C$14","v":0},{"$f":"'SUB. 9'!D$14","v":0},{"$f":"'SUB. 9'!E$14","v":0},{"$f":"'SUB. 9'!F$14","v":0},{"$f":"'SUB. 9'!G$14","v":0},{"$f":"'SUB. 9'!H$14","v":0},{"$f":"'SUB. 9'!I$14","v":0},{"$f":"'SUB. 9'!J$14","v":0}]
[null,0,{"$f":"'SUB. 10'!K$14","v":0},{"$f":"'SUB. 10'!C$14","v":0},{"$f":"'SUB. 10'!D$14","v":0},{"$f":"'SUB. 10'!E$14","v":0},{"$f":"'SUB. 10'!F$14","v":0},{"$f":"'SUB. 10'!G$14","v":0},{"$f":"'SUB. 10'!H$14","v":0},{"$f":"'SUB. 10'!I$14","v":0},{"$f":"'SUB. 10'!J$14","v":0}]
[null,0,{"$f":"'SUB. 11'!K$14","v":0},{"$f":"'SUB. 11'!C$14","v":0},{"$f":"'SUB. 11'!D$14","v":0},{"$f":"'SUB. 11'!E$14","v":0},{"$f":"'SUB. 11'!F$14","v":0},{"$f":"'SUB. 11'!G$14","v":0},{"$f":"'SUB. 11'!H$14","v":0},{"$f":"'SUB. 11'!I$14","v":0},{"$f":"'SUB. 11'!J$14","v":0}]
[null,0,{"$f":"'SUB. 12'!K$14","v":0},{"$f":"'SUB. 12'!C$14","v":0},{"$f":"'SUB. 12'!D$14","v":0},{"$f":"'SUB. 12'!E$14","v":0},{"$f":"'SUB. 12'!F$14","v":0},{"$f":"'SUB. 12'!G$14","v":0},{"$f":"'SUB. 12'!H$14","v":0},{"$f":"'SUB. 12'!I$14","v":0},{"$f":"'SUB. 12'!J$14","v":0}]
[null,0,{"$f":"'SUB. Extrativista'!K$14","v":0},{"$f":"'SUB. Extrativista'!C$14","v":0},{"$f":"'SUB. Extrativista'!D$14","v":0},{"$f":"'SUB. Extrativista'!E$14","v":0},{"$f":"'SUB. Extrativista'!F$14","v":0},{"$f":"'SUB. Extrativista'!G$14","v":0},{"$f":"'SUB. Extrativista'!H$14","v":0},{"$f":"'SUB. Extrativista'!I$14","v":0},{"$f":"'SUB. Extrativista'!J$14","v":0}]
[null,"Agroecossistema",{"$f":"SUM(C57:C69)","v":8543.5},2505,4843.5,907,288,0,0,3412,5131.5]
[]
[null,"Tabela 06: Indicadores de Produtividade do Trabalho no Agroecossistema e nos seus Subsistemas "]
[null,"Subsistema ","VA Mulher","VA  Homem","VA Jovens","VA Total Mulheres","VA Total  Homens","VA Autoconsumo / UTF",null,null,null,"VA Mercantil / UTF",null,null,null,"Produtividade do Trabalho I (VA/HT)","Produtividade do Trabalho II (VA/UTF)","Intensidade de Ocupação do trabalho por Área  (Área/UTF)","Renda Agrícola / HT"]
[]
[null,null,null,null,null,null,null,"Mulher","%","Homem","%","Mulher","%","Homem","%"]
[null,{"$f":"B37","v":"Bovino"},{"$f":"IF(D37=0,\"\",D57/C57*D37)","v":460.98419060342917},{"$f":"IF(D37=0,\"\",E57/C57*D37)","v":6453.7786684480079},{"$f":"IF(D37=0,\"\",(F57+G57)/C57*D37)","v":1593.237140948564},{"$f":"IF(D37=0,\"\",J57/C57*D37)","v":1326.7503896682256},{"$f":"IF(D37=0,\"\",K57/C57*D37)","v":7181.2496103317762},{"$f":"IF(E17=0,\"\",E17/(D17+E17)*(J57/C57)*D37/Agroecossistema!K$21)","v":10.315175605854973},{"$f":"IF(H76=0,\"\",H76/(J$89+H$89))","v":5.510449337595558E-3},{"$f":"IF(E17=0,\"\",E17/(D17+E17)*(K57/C57)*D37/Agroecossistema!L$21)","v":72.582308465834174},{"$f":"J76/(J$89+H$89)","v":3.8774049893992246E-2},{"$f":"IF(D17=0,\"\",D17/(D17+E17)*(J57/C57)*D37/Agroecossistema!K$21)","v":499.97343580500097},{"$f":"L76/(N$89+L$89)","v":{"$error":"#DIV/0!"}},{"$f":"IF(D17=0,\"\",D17/(D17+E17)*(K57/C57)*D37/Agroecossistema!L$21)","v":3518.0424967000536},{"$f":"N76/(N$89+L$89)","v":{"$error":"#DIV/0!"}},{"$f":"IF(D37=0,\"\",D37/C57)","v":2.5259407704297487},{"$f":"IF(D37=0,\"0\",D37/Agroecossistema!M$21)","v":1849.5652173913049},{"$f":"C17/Agroecossistema!M$21","v":0.98695652173913051},{"$f":"IF(F37=0,\"\",F37/C57)","v":2.5259407704297487}]
[null,"Suino",3633.9058171745155,3633.9058171745155,1842.1883656509697,5476.0941828254854,3633.9058171745155,{"$f":"IF(E18=0,\"\",E18/(D18+E18)*(J58/C58)*D38/Agroecossistema!K$21)","v":217.13299693994782},{"$f":"IF(H77=0,\"\",H77/(J$89+H$89))","v":0.11599418418807442},{"$f":"IF(E18=0,\"\",E18/(D18+E18)*(K58/C58)*D38/Agroecossistema!L$21)","v":187.3147328440472},0.10006502894012689,{"$f":"IF(D18=0,\"\",D18/(D18+E18)*(J58/C58)*D38/Agroecossistema!K$21)","v":1889.0570733775462},{"$error":"#DIV/0!"},{"$f":"IF(D18=0,\"\",D18/(D18+E18)*(K58/C58)*D38/Agroecossistema!L$21)","v":1629.6381757432107},{"$error":"#DIV/0!"},20.18836565096953,{"$f":"IF(D38=0,\"0\",D38/Agroecossistema!M$21)","v":1980.4347826086957},{"$f":"C18/Agroecossistema!M$21","v":2.1739130434782609E-3},20.18836565096953]
[null,"Ovino",72,72,36,108,72,{"$f":"IF(E19=0,\"\",E19/(D19+E19)*(J59/C59)*D39/Agroecossistema!K$21)","v":""},{"$f":"IF(H78=0,\"\",H78/(J$89+H$89))","v":{"$error":"#VALUE!"}},{"$f":"IF(E19=0,\"\",E19/(D19+E19)*(K59/C59)*D39/Agroecossistema!L$21)","v":""},{"$error":"#VALUE!"},{"$f":"IF(D19=0,\"\",D19/(D19+E19)*(J59/C59)*D39/Agroecossistema!K$21)","v":41.53846153846154},{"$error":"#DIV/0!"},{"$f":"IF(D19=0,\"\",D19/(D19+E19)*(K59/C59)*D39/Agroecossistema!L$21)","v":36},{"$error":"#DIV/0!"},0.39452054794520547,{"$f":"IF(D39=0,\"0\",D39/Agroecossistema!M$21)","v":39.130434782608695},{"$f":"C19/Agroecossistema!M$21","v":0.98695652173913051},0.39452054794520547]
[null,"Aves",1757.948717948718,0,439.4871794871795,2197.4358974358975,0,{"$f":"IF(E20=0,\"\",E20/(D20+E20)*(J60/C60)*D40/Agroecossistema!K$21)","v":764.12417929804644},{"$f":"IF(H79=0,\"\"\"\",H79/(J$89+H$89))","v":0.40820125013321751},{"$f":"IF(E20=0,\"\",E20/(D20+E20)*(K60/C60)*D40/Agroecossistema!L$21)","v":0},0,{"$f":"IF(D20=0,\"\",D20/(D20+E20)*(J60/C60)*D40/Agroecossistema!K$21)","v":81.043473561914027},{"$error":"#DIV/0!"},{"$f":"IF(D20=0,\"\",D20/(D20+E20)*(K60/C60)*D40/Agroecossistema!L$21)","v":0},{"$error":"#DIV/0!"},4.8162978573937476,{"$f":"IF(D40=0,\"0\",D40/Agroecossistema!M$21)","v":477.7034559643256},{"$f":"C20/Agroecossistema!M$21","v":0.98695652173913051},4.8162978573937476]
[null,"Lavoura Milho e palma",-91.314031180400889,-142.53897550111358,-16.146993318485524,-107.46102449888642,-142.53897550111358,{"$f":"IF(E21=0,\"\",E21/(D21+E21)*(J61/C61)*D41/Agroecossistema!K$21)","v":-8.2662326537604933},{"$f":"IF(H80=0,\"\",H80/(J$89+H$89))","v":-4.4158876195447786E-3},{"$f":"IF(E21=0,\"\",E21/(D21+E21)*(K61/C61)*D41/Agroecossistema!L$21)","v":-14.253897550111359},-7.6145461128730692E-3,{"$f":"IF(D21=0,\"\",D21/(D21+E21)*(J61/C61)*D41/Agroecossistema!K$21)","v":-33.064930615041973},{"$error":"#DIV/0!"},{"$f":"IF(D21=0,\"\",D21/(D21+E21)*(K61/C61)*D41/Agroecossistema!L$21)","v":-57.015590200445438},{"$error":"#DIV/0!"},-7.4239049740163321E-2,{"$f":"IF(D41=0,\"0\",D41/Agroecossistema!M$21)","v":-54.347826086956523},{"$f":"C21/Agroecossistema!M$21","v":0.21739130434782611},-0.27023014105419452]
[null,"Quintal - frutas e medicinais",1368.75,22.5,273.75,1642.5,22.5,{"$f":"IF(E22=0,\"\",E22/(D22+E22)*(J62/C62)*D42/Agroecossistema!K$21)","v":631.73076923076917},0.33747563123118463,{"$f":"IF(E22=0,\"\",E22/(D22+E22)*(K62/C62)*D42/Agroecossistema!L$21)","v":11.25},6.0098400082265763E-3,{"$f":"IF(D22=0,\"\",D22/(D22+E22)*(J62/C62)*D42/Agroecossistema!K$21)","v":""},{"$error":"#VALUE!"},{"$f":"IF(D22=0,\"\",D22/(D22+E22)*(K62/C62)*D42/Agroecossistema!L$21)","v":""},{"$error":"#VALUE!"},3.75,{"$f":"IF(D42=0,\"0\",D42/Agroecossistema!M$21)","v":361.95652173913044},{"$f":"C22/Agroecossistema!M$21","v":3.4782608695652174E-2},3.75]
[null,0,"","","","","",{"$f":"IF(E23=0,\"\",E23/(D23+E23)*(J63/C63)*D43/Agroecossistema!K$21)","v":""},{"$f":"IF(H82=0,\"\",H82/(J$89+H$89))","v":{"$error":"#VALUE!"}},{"$f":"IF(E23=0,\"\",E23/(D23+E23)*(K63/C63)*D43/Agroecossistema!L$21)","v":""},{"$error":"#VALUE!"},{"$f":"IF(D23=0,\"\",D23/(D23+E23)*(J63/C63)*D43/Agroecossistema!K$21)","v":""},{"$error":"#VALUE!"},{"$f":"IF(D23=0,\"\",D23/(D23+E23)*(K63/C63)*D43/Agroecossistema!L$21)","v":""},{"$error":"#VALUE!"},"",{"$f":"IF(D43=0,\"0\",D43/Agroecossistema!M$21)","v":"0"},{"$f":"C23/Agroecossistema!M$21","v":0},""]
[null,0,"","","","","",{"$f":"IF(E24=0,\"\",E24/(D24+E24)*(J64/C64)*D44/Agroecossistema!K$21)","v":""},{"$error":"#VALUE!"},{"$f":"IF(E24=0,\"\",E24/(D24+E24)*(K64/C64)*D44/Agroecossistema!L$21)","v":""},{"$error":"#VALUE!"},{"$f":"IF(D24=0,\"\",D24/(D24+E24)*(J64/C64)*D44/Agroecossistema!K$21)","v":""},{"$error":"#VALUE!"},{"$f":"IF(D24=0,\"\",D24/(D24+E24)*(K64/C64)*D44/Agroecossistema!L$21)","v":""},{"$error":"#VALUE!"},"",{"$f":"IF(D44=0,\"0\",D44/Agroecossistema!M$21)","v":"0"},{"$f":"C24/Agroecossistema!M$21","v":0},""]
[null,0,"","","","","",{"$f":"IF(E25=0,\"\",E25/(D25+E25)*(J65/C65)*D45/Agroecossistema!K$21)","v":""},{"$error":"#VALUE!"},{"$f":"IF(E25=0,\"\",E25/(D25+E25)*(K65/C65)*D45/Agroecossistema!L$21)","v":""},{"$error":"#VALUE!"},{"$f":"IF(D25=0,\"\",D25/(D25+E25)*(J65/C65)*D45/Agroecossistema!K$21)","v":""},{"$error":"#VALUE!"},{"$f":"IF(D25=0,\"\",D25/(D25+E25)*(K65/C65)*D45/Agroecossistema!L$21)","v":""},{"$error":"#VALUE!"},"",{"$f":"IF(D45=0,\"0\",D45/Agroecossistema!M$21)","v":"0"},{"$f":"C25/Agroecossistema!M$21","v":0},""]
[null,0,"","","","","",{"$f":"IF(E26=0,\"\",E26/(D26+E26)*(J66/C66)*D46/Agroecossistema!K$21)","v":""},{"$error":"#VALUE!"},{"$f":"IF(E26=0,\"\",E26/(D26+E26)*(K66/C66)*D46/Agroecossistema!L$21)","v":""},{"$error":"#VALUE!"},{"$f":"IF(D26=0,\"\",D26/(D26+E26)*(J66/C66)*D46/Agroecossistema!K$21)","v":""},{"$error":"#VALUE!"},{"$f":"IF(D26=0,\"\",D26/(D26+E26)*(K66/C66)*D46/Agroecossistema!L$21)","v":""},{"$error":"#VALUE!"},"",{"$f":"IF(D46=0,\"0\",D46/Agroecossistema!M$21)","v":"0"},{"$f":"C26/Agroecossistema!M$21","v":0},""]
[null,0,"","","","","",{"$f":"IF(E27=0,\"\",E27/(D27+E27)*(J67/C67)*D47/Agroecossistema!K$21)","v":""},{"$error":"#VALUE!"},{"$f":"IF(E27=0,\"\",E27/(D27+E27)*(K67/C67)*D47/Agroecossistema!L$21)","v":""},{"$error":"#VALUE!"},{"$f":"IF(D27=0,\"\",D27/(D27+E27)*(J67/C67)*D47/Agroecossistema!K$21)","v":""},{"$error":"#VALUE!"},{"$f":"IF(D27=0,\"\",D27/(D27+E27)*(K67/C67)*D47/Agroecossistema!L$21)","v":""},{"$error":"#VALUE!"},"",{"$f":"IF(D47=0,\"0\",D47/Agroecossistema!M$21)","v":"0"},{"$f":"C27/Agroecossistema!M$21","v":0},""]
[null,0,"","","","","",{"$f":"IF(E28=0,\"\",E28/(D28+E28)*(J68/C68)*D48/Agroecossistema!K$21)","v":""},{"$error":"#VALUE!"},{"$f":"IF(E28=0,\"\",E28/(D28+E28)*(K68/C68)*D48/Agroecossistema!L$21)","v":""},{"$error":"#VALUE!"},{"$f":"IF(D28=0,\"\",D28/(D28+E28)*(J68/C68)*D48/Agroecossistema!K$21)","v":""},{"$error":"#VALUE!"},{"$f":"IF(D28=0,\"\",D28/(D28+E28)*(K68/C68)*D48/Agroecossistema!L$21)","v":""},{"$error":"#VALUE!"},"",{"$f":"IF(D48=0,\"0\",D48/Agroecossistema!M$21)","v":"0"},{"$f":"C28/Agroecossistema!M$21","v":0},""]
[null,0,{"$error":"#DIV/0!"},{"$error":"#DIV/0!"},{"$error":"#DIV/0!"},{"$error":"#DIV/0!"},{"$error":"#DIV/0!"},{"$f":"IF(E29=0,\"\",E29/(D29+E29)*(J69/C69)*D49/Agroecossistema!K$21)","v":""},{"$error":"#VALUE!"},{"$f":"IF(E29=0,\"\",E29/(D29+E29)*(K69/C69)*D49/Agroecossistema!L$21)","v":""},{"$error":"#VALUE!"},{"$f":"IF(D29=0,\"\",D29/(D29+E29)*(J69/C69)*D49/Agroecossistema!K$21)","v":{"$error":"#DIV/0!"}},{"$error":"#DIV/0!"},{"$f":"IF(D29=0,\"\",D29/(D29+E29)*(K69/C69)*D49/Agroecossistema!L$21)","v":{"$error":"#DIV/0!"}},{"$error":"#DIV/0!"},{"$error":"#DIV/0!"},{"$f":"IF(D49=0,\"0\",D49/Agroecossistema!M$21)","v":2.173913043478261E-5},{"$f":"C29/Agroecossistema!M$21","v":0},{"$error":"#DIV/0!"}]
[null,"Agroecossistema",{"$f":"SUM(C76:C88)","v":{"$error":"#DIV/0!"}},{"$error":"#DIV/0!"},{"$error":"#DIV/0!"},{"$error":"#DIV/0!"},{"$error":"#DIV/0!"},1615.0368884208578,0.8627656272705273,{"$f":"SUM(J76:J88)","v":256.89314375977006},0.13723437272947267,{"$f":"SUM(L76:L88)","v":{"$error":"#DIV/0!"}},{"$error":"#DIV/0!"},{"$f":"SUM(N76:N88)","v":{"$error":"#DIV/0!"}},{"$error":"#DIV/0!"},{"$f":"IF(D51=0,\"\",D51/C70)","v":2.5060497451203725},{"$f":"IF(D51=0,\"0\",D51/Agroecossistema!M$21)","v":4654.4426081382398},{"$f":"C31/Agroecossistema!M$21","v":1.5217391304347827},{"$f":"IF(F51=0,\"\",F51/C70)","v":2.3234547898912505}]

{"sheet":"Indicadores II","index":2,"n_rows":43,"n_cols":15,"rows_kept":43,"cut":false,"hidden":false,"merged":[[2,1,2,14],[26,6,27,6],[26,7,27,7],[26,2,27,2],[26,3,27,3],[25,1,27,1],[26,11,26,14],[26,8,27,8],[26,9,27,9],[26,10,27,10],[25,2,25,14],[26,5,27,5],[36,2,37,2],[36,1,37,1],[15,1,15,11],[36,5,37,5],[36,3,37,3],[36,6,37,6],[36,10,37,10],[36,9,37,9],[36,7,37,7],[36,4,37,4],[36,8,37,8],[24,1,24,10],[16,2,17,11],[34,1,34,10],[35,2,35,10],[4,1,4,13],[16,1,18,1],[26,4,27,4],[5,11,7,13],[5,2,7,10],[5,1,8,1]]}
[]
[]
[null,"USO DOS TEMPOS E REPARTIÇÃO PROPORCIONAL DO VALOR AGREGADO SEGUNDO SEXO E ESFERAS DE OCUPAÇÃO ECONÔMICA"]
[]
[null,"Tabela 07: Tempos totais e parciais de ocupação efetiva (HT) e ocupação proporcional (% UTC) de diferentes segmentos do NSGA nas diferentes esferas de trabalho"]
[null,"Esferas de Ocupação","Tempo de Ocupação Efetiva HT/Ano",null,null,null,null,null,null,null,null,"Equivalente Unidade de Trabalho Contratada (UTC)"]
[]
[]
[null,null,"Mulher","Homem","Jovens Mulheres","Jovens Homens","Outras","Outros","Total Mulheres","Total Homens","Total Geral","Total Mulheres","Total Homens","Total Geral"]
[null,"Mercantil e Autoconsumo",{"$f":"'Indicadores I'!D70","v":2505},{"$f":"'Indicadores I'!E70","v":4843.5},{"$f":"'Indicadores I'!F70","v":907},{"$f":"'Indicadores I'!G70","v":288},{"$f":"'Indicadores I'!H70","v":0},{"$f":"'Indicadores I'!I70","v":0},{"$f":"'Indicadores I'!J70","v":3412},{"$f":"'Indicadores I'!K70","v":5131.5},{"$f":"'Indicadores I'!C70","v":8543.5},{"$f":"$I$14/$I$22*I10/$I$14/2105","v":0.39981251464729328},{"$f":"$J$14/$J$22*J10/$J$14/2105","v":0.96393350239504083},{"$f":"$K$14/$K$22*K10/$K$14/2105","v":0.61652534728486375}]
[null,"Doméstico e de Cuidados",{"$f":"Agroecossistema!C27","v":2920},{"$f":"Agroecossistema!D27","v":192},{"$f":"Agroecossistema!E27","v":2190},{"$f":"Agroecossistema!F27","v":0},{"$f":"Agroecossistema!G27","v":0},{"$f":"Agroecossistema!H27","v":0},{"$f":"C11+E11+G11","v":5110},192,{"$f":"Agroecossistema!K27","v":5302},{"$f":"$I$14/$I$22*I11/$I$14/2105","v":0.59878134520740578},{"$f":"$J$14/$J$22*J11/$J$14/2105","v":3.6066497604959141E-2},{"$f":"$K$14/$K$22*K11/$K$14/2105","v":0.38260869565217392}]
[null,"Participação Social",{"$f":"Agroecossistema!C28","v":12},{"$f":"Agroecossistema!D28","v":0},{"$f":"Agroecossistema!E28","v":0},{"$f":"Agroecossistema!F28","v":0},{"$f":"Agroecossistema!G28","v":0},{"$f":"Agroecossistema!H28","v":0},12,0,{"$f":"Agroecossistema!K28","v":12},{"$f":"$I$14/$I$22*I12/$I$14/2105","v":1.4061401453011487E-3},{"$f":"$J$14/$J$22*J12/$J$14/2105","v":0},{"$f":"$K$14/$K$22*K12/$K$14/2105","v":8.6595706296229476E-4}]
[null,"Pluriatividade",{"$f":"Agroecossistema!C29","v":0},{"$f":"Agroecossistema!D29","v":0},{"$f":"Agroecossistema!E29","v":0},{"$f":"Agroecossistema!F29","v":0},{"$f":"Agroecossistema!G29","v":0},{"$f":"Agroecossistema!H29","v":0},0,0,{"$f":"Agroecossistema!K29","v":0},{"$f":"$I$14/$I$22*I13/$I$14/2105","v":0},{"$f":"$J$14/$J$22*J13/$J$14/2105","v":0},{"$f":"$K$14/$K$22*K13/$K$14/2105","v":0}]
[null,"TOTAL (A)",{"$f":"C10+C11+C12+C13","v":5437},5035.5,3097,288,0,0,{"$f":"SUM(I10:I13)","v":8534},{"$f":"SUM(J10:J13)","v":5323.5},{"$f":"SUM(K10:K13)","v":13857.5},{"$f":"$I$14/$I$22*I14/$I$14/2105","v":1.0000000000000002},{"$f":"$J$14/$J$22*J14/$J$14/2105","v":1},{"$f":"$K$14/$K$22*K14/$K$14/2105","v":1}]
[]
[null,"Tabela 08: Composição do NSGA e dedicação de tempo de seus membros à gestão do agroecossistema"]
[null,null,"Composição do NSGA e Tempos Equivalentes de Ocupação"]
[]
[null,null,"Mulher","Homem","Jovens Mulheres","Jovens Homens","Outras","Outros","Total Mulheres","Total Homens","Total Geral","Crianças"]
[null,"Composição do NSGA ",{"$f":"Agroecossistema!D20","v":1},{"$f":"Agroecossistema!E20","v":1},{"$f":"Agroecossistema!F20","v":7},{"$f":"Agroecossistema!G20","v":6},{"$f":"Agroecossistema!H20","v":0},{"$f":"Agroecossistema!I20","v":0},{"$f":"Agroecossistema!K20","v":8},{"$f":"Agroecossistema!L20","v":7},{"$f":"Agroecossistema!M20","v":15},{"$f":"Agroecossistema!J20","v":0}]
[null,"Unidades de Trabalho Familiar",{"$f":"Agroecossistema!D23","v":1},{"$f":"Agroecossistema!E23","v":1},{"$f":"Agroecossistema!F23","v":1.6},{"$f":"Agroecossistema!G23","v":1},{"$f":"Agroecossistema!H23","v":0},{"$f":"Agroecossistema!I23","v":0},{"$f":"Agroecossistema!K23","v":2.6},{"$f":"Agroecossistema!L23","v":2},{"$f":"Agroecossistema!M23","v":4.5999999999999996}]
[null,"Equivalente Unidade de Trabalho Contratada (UTC)",{"$f":"C14/2105","v":2.582897862232779},{"$f":"D14/2105","v":2.3921615201900237},1.4712589073634204,0.13681710213776721,0,0,4.0541567695961991,2.528978622327791,6.5831353919239906]
[null,"Tempos médio ocupado por dia (HT/Dia)",{"$f":"C14/365","v":14.895890410958904},{"$f":"D14/365","v":13.795890410958904},8.4849315068493159,0.78904109589041094,0,0,23.38082191780822,14.584931506849315,37.965753424657535]
[]
[null,"Tabela 09: Equivalência do trabalho anual do NSGA em jornadas de oito horas"]
[null,"Esferas de Ocupação","Equivalência Emprego - Dias Trabalhados"]
[null,null,"Mulher","Homem","Jovens Mulheres","Jovens Homens","Outras","Outros","Total Mulheres","Total Homens","Total Geral","Total UTFs"]
[null,null,null,null,null,null,null,null,null,null,null,"Mulheres","%","Homens","%"]
[null,"Mercantil e Autoconsumo",{"$f":"C10/8","v":313.125},605.4375,113.375,36,0,0,426.5,641.4375,1067.9375,{"$f":"I29/Agroecossistema!K$21","v":164.03846153846152},{"$f":"L29/(L$33+N$33)","v":0.22077640565399831},{"$f":"J29/Agroecossistema!L$21","v":320.71875},{"$f":"N29/(L$33+N$33)","v":0.43164957892659445}]
[null,"Doméstico e de Cuidados",{"$f":"C11/8","v":365},24,273.75,0,0,0,638.75,24,662.75,{"$f":"I30/Agroecossistema!K$21","v":245.67307692307691},{"$f":"L30/(L$33+N$33)","v":0.33064696157442303},{"$f":"J30/Agroecossistema!L$21","v":12},{"$f":"N30/(L$33+N$33)","v":1.6150583485122504E-2}]
[null,"Participação Social",{"$f":"C12/8","v":1.5},0,0,0,0,0,1.5,0,1.5,{"$f":"I31/Agroecossistema!K$21","v":0.57692307692307687},{"$f":"L31/(L$33+N$33)","v":7.7647035986165883E-4},{"$f":"J31/Agroecossistema!L$21","v":0},{"$f":"N31/(L$33+N$33)","v":0}]
[null,"Pluriatividade",{"$f":"C13/8","v":0},0,0,0,0,0,0,0,0,{"$f":"I32/Agroecossistema!K$21","v":0},{"$f":"L32/(L$33+N$33)","v":0},{"$f":"J32/Agroecossistema!L$21","v":0},{"$f":"N32/(L$33+N$33)","v":0}]
[null,"Total (C)",{"$f":"C14/8","v":679.625},629.4375,387.125,36,0,0,1066.75,665.4375,1732.1875,{"$f":"I33/Agroecossistema!K$21","v":410.28846153846155},{"$f":"L33/(L$33+N$33)","v":0.55219983758828306},{"$f":"J33/Agroecossistema!L$21","v":332.71875},{"$f":"N33/(L$33+N$33)","v":0.44780016241171694}]
[]
[null,"Tabela 10: Repartição da renda por esfera de ocupação econômica por gênero e geração"]
[null,"Esferas de Ocupação","Repartição da Renda por Esfera de Trabalho por Gênero e Geração"]
[null,null,"Mulher","Homem","Jovens Mulheres","Jovens Homens","Outras","Outros","Total Mulheres","Total Homens","Total Geral"]
[]
[null,"Mercantil e Autoconsumo",{"$f":"IF($K$14=0,\"\",('Indicadores I'!$C$6+'Indicadores I'!$C$10)*(C10/$K$14))","v":4369.2543513315486},{"$f":"IF($K$14=0,\"\",('Indicadores I'!$C$6+'Indicadores I'!$C$10)*(D10/$K$14))","v":8448.0971858979465},{"$f":"IF($K$14=0,\"\",('Indicadores I'!$C$6+'Indicadores I'!$C$10)*(E10/$K$14))","v":1582.0014757116624},{"$f":"IF($K$14=0,\"\",('Indicadores I'!$C$6+'Indicadores I'!$C$10)*(F10/$K$14))","v":502.33343440458515},{"$f":"IF($K$14=0,\"\",('Indicadores I'!$C$6+'Indicadores I'!$C$10)*(G10/$K$14))","v":0},{"$f":"IF($K$14=0,\"\",('Indicadores I'!$C$6+'Indicadores I'!$C$10)*(H10/$K$14))","v":0},{"$f":"IF($K$14=0,\"\",('Indicadores I'!$C$6+'Indicadores I'!$C$10)*(I10/$K$14))","v":5951.25582704321},{"$f":"IF($K$14=0,\"\",('Indicadores I'!$C$6+'Indicadores I'!$C$10)*(J10/$K$14))","v":8950.4306203025299},{"$f":"IF($K$14=0,\"\",('Indicadores I'!$C$6+'Indicadores I'!$C$10)*(K10/$K$14))","v":14901.686447345741}]
[null,"Doméstico e de Cuidados",{"$f":"IF($K$14=0,\"\",('Indicadores I'!$C$6+'Indicadores I'!$C$10)*(C11/$K$14))","v":5093.1028766020445},{"$f":"IF($K$14=0,\"\",('Indicadores I'!$C$6+'Indicadores I'!$C$10)*(D11/$K$14))","v":334.88895626972345},{"$f":"IF($K$14=0,\"\",('Indicadores I'!$C$6+'Indicadores I'!$C$10)*(E11/$K$14))","v":3819.8271574515329},{"$f":"IF($K$14=0,\"\",('Indicadores I'!$C$6+'Indicadores I'!$C$10)*(F11/$K$14))","v":0},{"$f":"IF($K$14=0,\"\",('Indicadores I'!$C$6+'Indicadores I'!$C$10)*(G11/$K$14))","v":0},{"$f":"IF($K$14=0,\"\",('Indicadores I'!$C$6+'Indicadores I'!$C$10)*(H11/$K$14))","v":0},{"$f":"IF($K$14=0,\"\",('Indicadores I'!$C$6+'Indicadores I'!$C$10)*(I11/$K$14))","v":8912.9300340535774},{"$f":"IF($K$14=0,\"\",('Indicadores I'!$C$6+'Indicadores I'!$C$10)*(J11/$K$14))","v":334.88895626972345},{"$f":"IF($K$14=0,\"\",('Indicadores I'!$C$6+'Indicadores I'!$C$10)*(K11/$K$14))","v":9247.8189903233015}]
[null,"Participação Social",{"$f":"IF($K$14=0,\"\",('Indicadores I'!$C$6+'Indicadores I'!$C$10)*(C12/$K$14))","v":20.930559766857716},{"$f":"IF($K$14=0,\"\",('Indicadores I'!$C$6+'Indicadores I'!$C$10)*(D12/$K$14))","v":0},{"$f":"IF($K$14=0,\"\",('Indicadores I'!$C$6+'Indicadores I'!$C$10)*(E12/$K$14))","v":0},{"$f":"IF($K$14=0,\"\",('Indicadores I'!$C$6+'Indicadores I'!$C$10)*(F12/$K$14))","v":0},{"$f":"IF($K$14=0,\"\",('Indicadores I'!$C$6+'Indicadores I'!$C$10)*(G12/$K$14))","v":0},{"$f":"IF($K$14=0,\"\",('Indicadores I'!$C$6+'Indicadores I'!$C$10)*(H12/$K$14))","v":0},{"$f":"IF($K$14=0,\"\",('Indicadores I'!$C$6+'Indicadores I'!$C$10)*(I12/$K$14))","v":20.930559766857716},{"$f":"IF($K$14=0,\"\",('Indicadores I'!$C$6+'Indicadores I'!$C$10)*(J12/$K$14))","v":0},{"$f":"IF($K$14=0,\"\",('Indicadores I'!$C$6+'Indicadores I'!$C$10)*(K12/$K$14))","v":20.930559766857716}]
[null,"Pluriatividade",{"$f":"IF($K$14=0,\"\",('Indicadores I'!$C$6+'Indicadores I'!$C$10)*(C13/$K$14))","v":0},{"$f":"IF($K$14=0,\"\",('Indicadores I'!$C$6+'Indicadores I'!$C$10)*(D13/$K$14))","v":0},{"$f":"IF($K$14=0,\"\",('Indicadores I'!$C$6+'Indicadores I'!$C$10)*(E13/$K$14))","v":0},{"$f":"IF($K$14=0,\"\",('Indicadores I'!$C$6+'Indicadores I'!$C$10)*(F13/$K$14))","v":0},{"$f":"IF($K$14=0,\"\",('Indicadores I'!$C$6+'Indicadores I'!$C$10)*(G13/$K$14))","v":0},{"$f":"IF($K$14=0,\"\",('Indicadores I'!$C$6+'Indicadores I'!$C$10)*(H13/$K$14))","v":0},{"$f":"IF($K$14=0,\"\",('Indicadores I'!$C$6+'Indicadores I'!$C$10)*(I13/$K$14))","v":0},{"$f":"IF($K$14=0,\"\",('Indicadores I'!$C$6+'Indicadores I'!$C$10)*(J13/$K$14))","v":0},{"$f":"IF($K$14=0,\"\",('Indicadores I'!$C$6+'Indicadores I'!$C$10)*(K13/$K$14))","v":0}]
[null,"Total (B)",{"$f":"IF($K$14=0,\"\",('Indicadores I'!$C$6+'Indicadores I'!$C$10)*(C14/$K$14))","v":9483.2877877004503},{"$f":"IF($K$14=0,\"\",('Indicadores I'!$C$6+'Indicadores I'!$C$10)*(D14/$K$14))","v":8782.9861421676687},{"$f":"IF($K$14=0,\"\",('Indicadores I'!$C$6+'Indicadores I'!$C$10)*(E14/$K$14))","v":5401.8286331631953},{"$f":"IF($K$14=0,\"\",('Indicadores I'!$C$6+'Indicadores I'!$C$10)*(F14/$K$14))","v":502.33343440458515},{"$f":"IF($K$14=0,\"\",('Indicadores I'!$C$6+'Indicadores I'!$C$10)*(G14/$K$14))","v":0},{"$f":"IF($K$14=0,\"\",('Indicadores I'!$C$6+'Indicadores I'!$C$10)*(H14/$K$14))","v":0},{"$f":"IF($K$14=0,\"\",('Indicadores I'!$C$6+'Indicadores I'!$C$10)*(I14/$K$14))","v":14885.116420863646},{"$f":"IF($K$14=0,\"\",('Indicadores I'!$C$6+'Indicadores I'!$C$10)*(J14/$K$14))","v":9285.3195765722539},{"$f":"IF($K$14=0,\"\",('Indicadores I'!$C$6+'Indicadores I'!$C$10)*(K14/$K$14))","v":24170.435997435899}]

{"sheet":"Diagrama SÍntese","index":3,"n_rows":42,"n_cols":17,"rows_kept":42,"cut":false,"hidden":false,"merged":[[31,11,31,12],[1,2,1,18]]}
[]
[null,null,"Diagrama síntese dos fluxos econômico-ecológicos do agroecossistema"]
[]
[]
[]
[]
[]
[]
[]
[]
[]
[]
[]
[null,null,null,null,null,null,null,null,null,null,null,{"$f":"'Indicadores I'!L51","v":3.2564232183136417}]
[]
[]
[null,null,null,null,null,{"$f":"'Indicadores I'!O31","v":5729.2307692307695},null,null,null,null,null,null,null,null,null,null,{"$f":"'Indicadores I'!D31","v":18656.800100000004}]
[]
[]
[]
[]
[]
[]
[null,null,null,null,null,null,null,null,{"$f":"F17/(F17+F30+F42)","v":0.32487968590310923}]
[]
[]
[]
[]
[]
[null,null,null,null,null,{"$f":"'TG Grau Merc.'!N21","v":10080.700000000001},null,null,null,null,null,null,null,null,null,null,{"$f":"'Indicadores I'!E31","v":4410.2}]
[]
[null,null,null,null,null,null,null,null,null,null,null,{"$f":"F30+Q30+Q42+F42","v":18828.566666666669}]
[]
[]
[]
[]
[]
[]
[]
[]
[]
[null,null,null,null,null,{"$f":"GETPIVOTDATA(\"Soma de Entrada serviços e produtos \",'TD ERS para Diagrama'!$A$3)","v":1825},null,null,null,null,null,null,null,null,null,null,{"$f":"'Indicadores I'!F31","v":2512.6666666666665}]

{"sheet":"Gráficos Renda","index":4,"n_rows":202,"n_cols":15,"rows_kept":202,"cut":false,"hidden":false,"merged":[[7,18,7,19],[3,14,9,15],[1,1,1,15]]}
[]
[null,"Gráficos Renda"]
[]
[null,null,null,null,null,null,null,null,null,null,null,null,null,null,"Após inserir dados clique na Guia acima opção \"DADOS\", comando \"Atualizar Tudo\""]
[]
[]
[]
[]
[]
[]
[]
[]
[]
[]
[]
[]
[]
[]
[]
[]
[]
[]
[]
[]
[]
[]
[]
[]
[]
[]
[]
[]
[]
[]
[]
[]
[]
[]
[]
[]
[]
[]
[]
[]
[]
[]
[]
[]
[]
[]
[]
[]
[]
[]
[]
[]
[]
[]
[]
[]
[]
[]
[]
[]
[]
[]
[]
[]
[]
[]
[]
[]
[]
[]
[]
[]
[]
[]
[]
[]
[]
[]
[]
[]
[]
[]
[]
[]
[]
[]
[]
[]
[]
[]
[]
[]
[]
[]
[]
[]
[]
[]
[]
[]
[]
[]
[]
[]
[]
[]
[]
[]
[]
[]
[]
[]
[]
[]
[]
[]
[]
[]
[]
[]
[]
[]
[]
[]
[]
[]
[]
[]
[]
[]
[]
[]
[]
[]
[]
[]
[]
[]
[]
[]
[]
[]
[]
[]
[]
[]
[]
[]
[]
[]
[]
[]
[]
[]
[]
[]
[]
[]
[]
[]
[]
[]
[]
[]
[]
[]
[]
[]
[]
[]
[]
[]
[]
[]
[]
[]
[]
[]
[]
[]
[]
[]
[]
[]
[]
[]
[null,null,null,null,null,null,null,null,null,null,null,null,1,{"$f":"'Indicadores I'!B17","v":"Bovino"}]
[null,null,null,null,null,null,null,null,null,null,null,null,2,{"$f":"'Indicadores I'!B18","v":"Suino"}]
[null,null,null,null,null,null,null,null,null,null,null,null,3,{"$f":"'Indicadores I'!B19","v":"Ovino"}]
[null,null,null,null,null,null,null,null,null,null,null,null,4,{"$f":"'Indicadores I'!B20","v":"Aves"}]
[null,null,null,null,null,null,null,null,null,null,null,null,5,{"$f":"'Indicadores I'!B21","v":"Lavoura Milho e palma"}]
[null,null,null,null,null,null,null,null,null,null,null,null,6,{"$f":"'Indicadores I'!B22","v":"Quintal - frutas e medicinais"}]
[null,null,null,null,null,null,null,null,null,null,null,null,7,{"$f":"'Indicadores I'!B23","v":0}]
[null,null,null,null,null,null,null,null,null,null,null,null,8,{"$f":"'Indicadores I'!B24","v":0}]
[null,null,null,null,null,null,null,null,null,null,null,null,9,{"$f":"'Indicadores I'!B25","v":0}]
[null,null,null,null,null,null,null,null,null,null,null,null,10,{"$f":"'Indicadores I'!B26","v":0}]
[null,null,null,null,null,null,null,null,null,null,null,null,11,{"$f":"'Indicadores I'!B27","v":0}]
[null,null,null,null,null,null,null,null,null,null,null,null,12,{"$f":"'Indicadores I'!B28","v":0}]

{"sheet":"Gráficos Trabalho","index":5,"n_rows":4,"n_cols":20,"rows_kept":4,"cut":false,"hidden":false,"merged":[[3,19,8,20],[1,1,1,20]]}
[]
[null,"Gráficos Trabalho"]
[]
[null,null,null,null,null,null,null,null,null,null,null,null,null,null,null,null,null,null,null,"Após inserir dados clique na Guia acima opção \"DADOS\", comando \"Atualizar Tudo\""]

{"sheet":"Plan1","index":6,"n_rows":0,"n_cols":0,"rows_kept":0,"cut":false,"hidden":true,"merged":[]}

{"sheet":"Gráficos reciprocidade","index":7,"n_rows":2,"n_cols":2,"rows_kept":2,"cut":false,"hidden":false,"merged":[[1,1,1,14]]}
[]
[null,"Reciprocidade Ecológica e Social"]

{"sheet":"MENU","index":8,"n_rows":27,"n_cols":14,"rows_kept":27,"cut":false,"hidden":false,"merged":[[0,1,2,16],[35,1,37,16],[4,10,5,10],[12,10,12,15],[12,3,12,8],[4,6,4,8],[6,6,6,8],[8,6,8,8],[10,6,10,8],[3,15,3,16],[3,1,3,3]]}
[null," LUME - Método da Análise Econômico-Ecológica de Agroecossistemas"]
[]
[]
[null,"Versão atualizada em 03 de outubro de 2019 "]
[null,null,null,null,"Família",":",{"$f":"Agroecossistema!C4","v":"Manoel Inacio/Adenice Vieira"},null,null,null,"Ano de referência",":","Inicio","Fim"]
[null,null,null,null,null,null,null,null,null,null,null,null,"mês/ano","mês/ano"]
[null,null,null,null,"Comunidade",":",{"$f":"Agroecossistema!C6","v":"Tanque de Pedra / Sitio Balaio"},null,null,null,null,null,{"$f":"Agroecossistema!P6","v":"2015-11-01"},{"$f":"Agroecossistema!Q6","v":"2016-11-01"}]
[]
[null,null,null,null,"Município",":",{"$f":"Agroecossistema!C11","v":"Nossa Senhora do Glória"}]
[]
[null,null,null,null,"Estado",":",{"$f":"Agroecossistema!C12","v":"Sergipe"}]
[]
[null,null,null,"  Entrada de Dados",null,null,null,null,null,null,"Consulta indicadores e gráficos"]
[]
[null,null,null,null,null,null,null,{"$f":"'SUB. 7'!D6","v":0}]
[]
[null,null,null,null,{"$f":"'SUB. 1'!D6","v":"Bovino"},null,null,{"$f":"'SUB. 8'!D6","v":0}]
[]
[null,null,null,null,{"$f":"'SUB. 2'!D6","v":"Suino"},null,null,{"$f":"'SUB. 9'!D6","v":0}]
[]
[null,null,null,null,{"$f":"'SUB. 3'!D6","v":"Ovino"},null,null,{"$f":"'SUB. 10'!D6","v":0}]
[]
[null,null,null,null,{"$f":"'SUB. 4'!D6","v":"Aves"},null,null,{"$f":"'SUB. 11'!D6","v":0}]
[]
[null,null,null,null,{"$f":"'SUB. 5'!D6","v":"Lavoura Milho e palma"},null,null,{"$f":"'SUB. 12'!D6","v":0}]
[]
[null,null,null,null,{"$f":"'SUB. 6'!D6","v":"Quintal - frutas e medicinais"},null,null,{"$f":"'SUB. Extrativista'!D6","v":0}]

{"sheet":"Instruções","index":9,"n_rows":178,"n_cols":4,"rows_kept":178,"cut":false,"hidden":false,"merged":[[2,0,2,1],[4,0,4,1],[6,0,6,1]]}
[]
[null,null,null,"Processamento dos dados econômicos "]
[null,null,null,"Os dados levantados em campo, correspondentes aos fluxos econômicos identificados na modelização dos agroecossistemas, são lançados e processados nesta planilha  eletrônica. Ela está estruturada em duas partes: a primeira destina-se à entrada dos dados (abas verdes); a segunda apresenta tabelas e gráficos elaborados a partir de um conjunto de indicadores da economia do agroecossistema (abas azuis). A planilha conta também com um menu com funções de atalho para facilitar o acesso às demais abas (aba de cor laranja)."]
[null,null,null,"Entrada dos dados (abas verdes)"]
[null,null,null,"A seção reservada à entrada dos dados econômicos é composta por quatorze abas. Os dados relativos ao conjunto do agroecossistema são lançados na primeira aba da seção (aba verde-escuro). Os dados específicos dos subsistemas são lançados nas demais 13 abas (verde-claro), sendo 12 delas para subsistemas de produção animal e vegetal e uma reservada para as atividades de extrativismo.   "]
[null,null,null,"Como a planilha cruza um conjunto grande de dados e informações registradas nas diferentes abas e tabelas, é essencial a padronização das unidades e termos empregados para quantificar e designar produtos, insumos e serviços. Variações na unidade de quantificação de um mesmo item em diferentes tabelas da planilha implicarão distorções na geração dos indicadores e gráficos. Embora possam ser empregadas diferentes unidades para um mesmo item na análise de diferentes agroecossistemas (por exemplo, “quilos” ou “sacos” de milho), sugere-se a padronização das unidades em um mesmo território, de forma a permitir análises comparativas entre agroecossistemas. Esse cuidado no preenchimento dos campos também é extensivo à digitação dos termos, já que a planilha não identifica como equivalentes palavras semanticamente idênticas, mas digitadas de forma diferente. Um cuidado especial deve ser observado no uso de maiúsculas e minúsculas (ex.: Ovo e ovo) e singular e plural (Ovo e Ovos). "]
[null,null,null,"[1] A Planilha encontra-se disponível em http://aspta.org.br/aspta-temas-de-intervencao/monitoramento-da-transicao-agroecologica-2/."]
[null,null,null,"[1] Assumiu-se na concepção da planilha que o agroecossistema possui um limite máximo de 13 subsistemas. Os subsistemas de produção vegetal e animal exploram um espaço ambiental definido (em hectares) e as atividades extrativistas realizadas em territórios de uso comum são realizadas em espaços físicos variáveis. Por essa razão, a aba reservada às atividades extrativistas se diferencia das abas dedicadas a entrada de dados de subsistemas de produção animal e vegetal. "]
[null,null,null,"Agroecossistema (aba verde-escura)"]
[null,null,null,"Os campos a seguir devem ser preenchidos na aba reservada à entrada de dados relacionados ao conjunto do agroecossistema."]
[null,null,null,"Núcleo Social de Gestão do Agroecossistema (NSGA) "]
[null,null,null,"Caso o agroecossistema considerado seja gerido exclusivamente por uma família, são introduzidos nesse campo os nomes dos principais responsáveis pelas decisões de estão. Caso o agroecossistema seja gerido por uma comunidade (um conjunto de núcleos familiares), mas a análise realizada se refira à economia de apenas uma família integrante dessa comunidade, adota-se o mesmo procedimento. "]
[null,null,null,"Caso o agroecossistema seja gerido por uma comunidade e a anális se refira à economia do conjunto da comunidade, introduz-se nesse campo o nome da comunidade."]
[null,null,null,"Comunidade "]
[null,null,null,"Nome da comunidade à qual o NSGA está vinculado (caso o NSGA não seja a própria comunidade)."]
[null,null,null,"Coordenadas geográficas "]
[null,null,null,"Inserir as coordenadas da residência da família ou da sede da comunidade (no formato “graus, minutos e segundos”)."]
[null,null,null,"Município "]
[null,null,null,"Indicar o nome do município em que se localiza a comunidade."]
[null,null,null,"Estado "]
[null,null,null,"Indicar o estado da federação em que se localiza o município."]
[null,null,null,"Ciclo anual de referência "]
[null,null,null,"Indicar mês e ano de início e de fim do ciclo econômico abrangido pelos dados econômicos lançados na planilha (o ciclo deve ser necessariamente de 12 meses). "]
[null,null,null,"Data da coleta dos dados "]
[null,null,null,"Caso o levantamento de dados em campo tenha sido realizado em mais de um dia, indicar a data da última entrevista"]
[null,null,null,"Área (em hectares) "]
[null,null,null,"Indicar a extensão territorial (em hectares) efetivamente utilizada pelo NSGA para a produção econômica no período considerado.  Essa extensão corresponde à soma das áreas próprias com as áreas de terceiros utilizadas no período, além de proporções de áreas comunitárias exploradas pelo NSGA para a produção animal e/ou vegetal.  As áreas próprias são aquelas sobre as quais o NSGA tem estabilidade de acesso exclusivo sob os mais variados regimes (propriedade privada, posse, cessão de uso, etc.). Pode compreender diferentes parcelas, mesmo que não contíguas. Áreas de reserva ambiental, em pousio e parcelas do terreno impróprias para a produção vegetal e animal também são consideradas."]
[null,null,null,"As áreas de terceiros ou comunitárias correspondem às extensões de terra utilizadas no período considerado (ou em parte dele) para a produção vegetal e animal. O acesso a áreas de terceiros se dá por meio de regras mercantis (aluguel, arrendamento, comodato, foro, meia, etc.) ou de regras de reciprocidade (cessão, empréstimo temporário etc.). O acesso a áreas comunitárias se faz por meio de regras ou costumes estabelecidos localmente (consuetudinárias). "]
[null,null,null,"Embora as áreas comunitárias sejam, por princípio, indivisíveis, para efeito de adequação ao cálculo econômico de um agroecossistema de gestão familiar assumimos as seguintes premissas: "]
[null,null,null,"a) caso a área seja ocupada pela família com cultivos anuais, considera-se a área efetivamente ocupada com a lavoura; "]
[null,null,null,"b) caso a lavoura seja coletiva, considera-se a fração da área proporcional ao acordo de partilha estabelecido no coletivo; "]
[null,null,null,"c) caso a área seja utilizada para pastoreio, sua dimensão é estimada em conjunto com a família e corresponde ao espaço territorial efetivamente explorado pelo seu rebanho. "]
[null,null,null,"Um tratamento diferenciado é dado para as áreas de uso comum nas quais são realizadas atividades de extrativismo vegetal, pesca artesanal e/ou caça, ou seja, em espaços ambientais cujo usufruto é compartilhado por uma determinada comunidade (por ex. fundos de pasto, reservas extrativistas, áreas coletivas em assentamentos, rios, lagos, florestas etc.). Embora a apropriação de bens naturais nesses territórios integre organicamente a economia dos NSGA, essas extensões não são contabilizadas na determinação da área do agroecossistema. A identificação das áreas dos subsistemas tem por objetivo permitir a geração de indicadores de intensidade econômica por unidade de área. Ocorre que esse indicador não corresponde à racionalidade econômico-ecológica empregada por comunidades extrativistas. Por essa razão, para que os bens naturais apropriados nessas situações sejam inseridos na contabilidade do agroecossistema, a planilha conta com uma aba específica para o lançamento de dados de subsistemas extrativistas (ver na sequência). "]
[null,null,null,"Composição do NSGA "]
[null,"↑",null,"Indicar o número de pessoas diretamente dependentes das riquezas geradas no agroecossistema, sejam elas residentes ou não. Essa composição é discriminada por gênero (homem, mulher) e geração (adultos, jovens e crianças). Caso o NSGA seja uma família, são considerados também os parentes e/ou agregados que dependem regularmente das rendas agrícolas geradas. Não são considerados nessa composição os prestadores de serviços remunerados uma vez que seus vínculos com o NSGA são efetivados por meio da venda de serviços. Os membros das famílias que não têm vínculos de trabalho e de consumo com o agroecossistema não são contabilizados. As informações sobre esses membros devem ser registradas no campo “observações”."]
[null,null,null,"» Equivalente em Unidades de Trabalho Familiar (UTF) "]
[null,null,null,"O dimensionamento da força de trabalho do NSGA em UTF (ver orientações na página 178) tem por objetivo identificar proporções da renda anual gerada pela contribuição do trabalho de homens, mulheres, adultos e jovens. O trabalho realizado nas esferas de ocupação econômica relacionadas direta ou indiretamente à geração de rendas agrícolas (“mercantil e autoconsumo”, “doméstico” e “participação social”) são lançadas na linha “UTF Agroecossistema” segundo as especificações por gênero e geração. As estimativas em UTFs da força de trabalho alocada em atividades não agrícolas são lançadas na linha “UTF Pluriatividade” segundo as mesmas especificações."]
[null,null,null,"» Tempo estimado de ocupação dos membros do NSGA por esfera de trabalho (horas/ano):"]
[null,null,null,"Nesses campos são inseridas as estimativas dos tempos dedicados no período aos trabalhos realizados nas esferas “doméstica”, “participação social” e “pluriatividade”. Os tempos dedicados ao trabalho na esfera “mercantil e autoconsumo” são lançados nas abas reservadas ao lançamento dos dados econômicos dos subsistemas. A distribuição dos tempos de trabalho deve ser feita em relação aos seguintes segmentos do NSGA:"]
[null,null,null,"a) Mulher e Homem: Indicar os tempos de trabalho empregados pelo casal responsável pela gestão do agroecossistema, caso o NSGA seja uma família. Essa responsabilidade pode ser assumida por uma só pessoa, caso seja solteira ou viúva. Pode também ser assumida por dois homens ou por duas mulheres."]
[null,null,null,"b) Jovens Mulheres e Jovens Homens: Indicar os tempos de trabalho empregados pelas(os) jovens."]
[null,null,null,"c) Outras e Outros: Indicar aos tempos de trabalho empregados pelas demais pessoas adultas integrantes do NSGA."]
[null,null,null,"d) Total Mulheres e Total Homens: Apresenta automaticamente o somatório dos dados lançados nas colunas anteriores."]
[null,null,null,"» Rendas não agrícolas:"]
[null,null,null,"   Indicar nessa tabela as rendas não agrícolas auferidas no período anual considerado por todos os membros do NSGA. As rendas não agrícolas originam-se de duas fontes:\na) Pluriatividade: corresponde à venda de serviços ou produtos não agrícolas (assalariamento, diárias, empreitadas, turismo rural, artesanato – desde que não elaborado com produtos gerados no agroecossistema, etc.). Artesanatos cujas matérias-primas são oriundas principalmente do agroecossistema são contabilizados como produtos de um subsistema específico. Portanto, geram rendas agrícolas.\nb) Transferências de renda: direitos sociais – previdência, bolsa família, bolsa de estudo, seguro safra, remessa de parentes, outras."]
[null,null,null,"   Essas rendas podem ser obtidas segundo cronogramas regulares, como os ingressos mensais de salários e aposentadorias, ou segundo entradas eventuais, como a venda de serviços em regime de diárias ou de empreitadas. Recomenda-se preencher o campo Observações para que sejam indicados os membros dos NSGA responsáveis pela obtenção das rendas não agrícolas registradas e para que sejam fornecidas informações adicionais sobre a natureza dessas rendas."]
[null,null,null,"» Inventário patrimonial (capital agrário):"]
[null,null,null,"   O inventário patrimonial corresponde ao levantamento físico e financeiro do capital agrário do agroecossistema, ou seja, dos bens materiais cujos ciclos de reprodução ou de reposição são superiores ao período considerado na análise. A variação do capital agrário no período analisado (ou balanço patrimonial) deve ser contabilizada nos resultados econômicos do ano. Essa cifra é obtida automaticamente após o lançamento dos valores financeiros estimados de cada um dos itens inventariados nos campos correspondentes ao início e ao final do período."]
[null,null,null,"    O inventário do capital agrário é organizado em uma tabela subdividida em duas seções principais: capital fundiário e capital fixo. O capital fundiário corresponde ao patrimônio imóvel, ou seja, o capital imobilizado em terras, em infraestruturas, em matas e em plantios perenes. O capital fixo corresponde ao patrimônio móvel e contempla duas categorias: a) capital inanimado (equipamentos) e b) capital vivo (semoventes).\n    Do ponto de vista metodológico, o levantamento do inventário patrimonial é um exercício que comporta alguma complexidade dada a dificuldade de contabilização das unidades de cada item inventariado e a ausência de referenciais de preço de mercado para muitos desses itens. Diante dessa complexidade, busca-se dimensionar o capital agrário de forma aproximativa para que seja possível o estabelecimento de uma visão global da contribuição do ciclo econômico avaliado sobre a construção do capital agrário. O patrimônio é um indicador da base de recursos autocontrolada do agroecossistema. Algumas sugestões metodológicas para o levantamento estimativo dos valores financeiros do capital agrário:"]
[null,null,null,"» Capital Fundiário"]
[null,null,null," Terra: Levantar o valor unitário médio de terra equivalente na região (sem considerar as infraestruturas) e multiplicar pelo número de unidades de corrigindo ao final para hectares.\n Infraestruturas: Estimar o valor de cada infraestrutura integrante do agroecossistema (residência da família, cercas, curral, cisternas, esterqueiras, etc.). Caso não tenham sido instaladas ou desativadas infraestruturas no período considerado, os valores do início devem ser iguais ao do final do período. A depreciação das infraestruturas não é contabilizada financeiramente."]
[null,null,null,"» Capital Fixo"]
[null,null,null,"   CF Equipamentos: Estimar o valor de cada equipamento que integra o agroecossistema (máquina forrageira, automóvel, microtrator, etc.). Ao final do período, não deve ser descontado o valor da depreciação dos equipamentos.\n  CF Vivo (Semovente): Corresponde aos planteis animais do agroecossistema. Trata-se de um recurso preexistente ao período de referência que poderá ser utilizado em futuros ciclos de produção consumo e venda.\nPara que o inventário dos planteis animais seja bem elaborado é necessário indicar o número de animais por espécie e categoria de valor. Por exemplo, os bovinos podem ser indicados nas categorias reprodutores (machos), matrizes (fêmeas reprodutoras e produtoras de leite), garrotes (machos de 12 a 24 meses), novilhas (fêmeas de 12\na 24 meses) e bezerros (animais de até um ano)."]
[null,null,null,"» Pagamento a terceiros (custos sistêmicos):"]
[null,null,null,"   Corresponde aos pagamentos efetuados pelo NSGA para a reprodução do conjunto do agroecossistema, ou seja, cujos custos não podem ser atribuídos a nenhum subsistema em específico. Exemplos: terras arrendadas, imposto territorial, assalariamento, diárias, luz, mensalidades de associações, sindicatos e cooperativas, serviços de dívidas, etc.\n   Quando esses itens de custo correspondem à reprodução de subsistemas específicos, os valores deverão ser lançados nas tabelas “pagamento a terceiros” nas abas dos subsistemas correspondentes."]
[null,null,null,"» Estoque de insumos"]
[null,null,null,"   O domínio de informação por parte das(os) agricultoras(es) sobre os volumes de insumos estocados de um ano para o outro varia consideravelmente em função do tipo de insumo. Além disso, a ausência de preços de mercado de alguns insumos costuma ser uma dificuldade no dimensionamento desses estoques em equivalente monetário.\nPara lidar com essas dificuldades metodológicas, sugere-se registrar na tabela pelo menos os volumes estocados em infraestruturas específicas para esse fim, como silos de forragem, esterqueiras, bancos de sementes, etc. Embora apresente apenas uma aproximação dos volumes de recursos que passam de um ciclo produtivo para outro, esse dimensionamento parcial é suficiente para dar visibilidade a fluxos econômicos importantes no funcionamento do agroecossistema."]
[null,null,null,"Como metodologia para o levantamento desses dados durante a condução da entrevista, sugere-se estimar primeiro os estoques produzidos no final do período analisado (cujo registro na memória dos entrevistados é mais recente) e em seguida os estoques existentes no final do período anterior."]
[null,null,null,"• Subsistemas (abas verde-claras)"]
[null,null,null,"Os campos a seguir devem ser preenchidos nas abas reservadas para a entrada de dados relacionados aos subsistemas."]
[null,null,null,"» Identificação do subsistema:"]
[null,null,null,"Indicar os nomes atribuídos a cada subsistema nos campos de identificação na sequência de abas entre o subsistema 1 e o subsistema 13. O subsistema 13 está reservado para a introdução de dados relacionados a atividades extrativistas. Os subsistemas são individualizados como unidades básicas de gestão econômico-ecológica do agroecossistema. Isso significa que correspondem a sistemas de organização do trabalho, não devendo ser entendidos exclusivamente como espaços físicos nem como sistemas técnicos de produção de itens específicos. O processo de trabalho em um subsistema pode ocupar diferentes espaços físicos no decorrer do ano (ver explicação adiante) e gerar diferentes produtos. Por outro lado, um mesmo item pode ser produzido em diferentes subsistemas. Por exemplo: embora possam produzir exatamente os mesmos itens, um roçado próprio e um roçado realizado em parceria com um vizinho devem ser considerados subsistemas independentes, pois são geridos em diferentes processos de trabalho."]
[null,null,null,"» Área do subsistema:"]
[null,null,null,"   Indicar o espaço físico (em hectares) efetivamente explorado pelo subsistema durante o ciclo econômico analisado. Essa extensão corresponde ao espaço ambiental onde bens e serviços ecológicos são diretamente apropriados para a posterior conversão em bens econômicos. Essa informação é essencial para a determinação de indicadores de intensidade econômica por unidade de área (R$/ha). Alguns cuidados metodológicos relacionados ao dimensionamento das áreas dos subsistemas devem ser observados para que sejam evitadas distorções na análise desses indicadores."]
[null,null,null,"• As áreas de subsistemas de produção vegetal são facilmente dimensionadas já que suas produções econômicas são geradas a partir do uso direto do solo. Nesses subsistemas, as rendas são geradas pela valorização da biomassa produzida pelo processo de fotossíntese (por organismos produtores). Há situações em que as produções vegetais são realizadas em espaços físicos dispersos no agroecossistema. A presença de árvores frutíferas em diferentes áreas dos estabelecimentos rurais é um caso comum dessas situações. Nessas situações, estima-se a área efetivamente ocupada pelas árvores (como se estivessem fisicamente dispostas em um pomar)."]
[null,null,null,"• As áreas de subsistemas de produção animal correspondem aos espaços físicos explorados no período considerado (pastos, capineiras, infraestruturas, etc.). Nesses subsistemas, as rendas são geradas pela valorização da biomassa produzida por organismos consumidores de biomassa gerada em outros processos ecológicos. Os animais podem circular em diferentes espaços físicos, indo ao encontro da biomassa que consomem, ou podem ser mantidos em um espaço fixo (onde acessam toda a biomassa consumida). No primeiro caso, a área do subsistema compreende a soma de todos os espaços explorados nos diferentes momentos do ciclo econômico analisado. Essa mobilidade sazonal dos animais faz com que a soma das áreas dos subsistemas frequentemente supere a área total do agroecossistema. No segundo caso, a área do subsistema compreende o espaço ambiental no qual os animais são contidos durante todo o período analisado. Essa regra também é válida para os criatórios confinados em aviários, pocilgas, currais, etc."]
[null,null,null,"OBS - Os subsistemas de confinamento intensivo de animais têm baixos índices de endogeneidade (ver explicação na página 204) já que dependem de alto nível de importação de insumos (matéria e energia) provenientes de outros espaços ambientais. Os ganhos econômicos nessas situações resultam essencialmente das margens entre receitas monetárias e custos monetários por unidade de produto, sendo a atividade gerida segundo uma lógica de economia de escala. Por essa razão, o indicador de intensidade econômica por área é uma informação de baixa relevância para esse tipo de subsistema. "]
[null,null,null,"• As áreas não são determinadas no caso de subsistemas extrativistas cuja apropriação dos bens ecológicos é realizada em espaços ambientais de uso comum. Como os territórios de uso comum são espaços físicos indivisíveis do ponto de vista da análise econômica, não cabe a determinação dos indicadores de intensidade por unidade de área. A planilha conta com uma aba específica para a entrada de dados relacionados à economia de subsistemas extrativistas."]
[null,null,null,"» Horas trabalhadas: Introduzir os quantitativos de horas trabalhadas no período considerado no subsistema segundo a divisão social entre os membros do NSGA (por sexo e por geração)."]
[null,null,null,"» Produtos e insumos gerados:"]
[null,null,null,"Introduzir volumes e preços unitários de todos os produtos e insumos gerados pelo subsistema no decorrer do\nperíodo analisado. As totalizações de volumes e valores financeiros são automaticamente preenchidas nessa tabela com a introdução de dados e informações nas seguintes colunas:\n• Item: nome do produto ou do insumo\n• Unidade: referência de peso, volume ou medida tradicionalmente adotada na região para o item correspondente\n• Valor unitário: para os produtos adotar preço de venda no mercado; para os insumos adotar preço de compra no mercado\n• Na coluna “Produtos” indicar quantidades (número de unidades) de venda, de autoconsumo, de trocas/doações, de estoque."]
[null,null,null,"Obs. 1: É necessário considerar o fato de que existem produções consumidas, vendidas ou trocadas/doadas no período analisado que resultam, ao menos em parte, de estoques produzidos em ciclos econômicos precedentes. Conceitualmente, esses estoques representam rendas potenciais resultantes de processos de trabalho realizados antes do período considerado. Esse é o caso típico da venda de bovinos adultos para o abate. O dimensionamento preciso da renda efetivamente gerada pelo trabalho realizado no período analisado é um exercício que requer detalhamento dos da193 dos levantados em campo. Esse investimento é necessário sempre que o objetivo do estudo é detalhar o funcionamento econômico de subsistemas produtores de rendas geradas em ciclos econômicos com duração superior a 12 meses. Caso esse detalhamento não seja necessário, assume-se que as rendas auferidas com a realização econômica desses produtos são resultado do período analisado. Esse procedimento não chega a comprometer a qualidade da análise, já que uma parte do trabalho realizado no período é investida na produção de itens que não serão contabilizados no final do período como renda, mas como estoque de produtos. Há, portanto, algum nível de compensação entre a realização econômica de estoques derivados de ciclos econômicos anteriores (venda, autoconsumo, troca e/ou doação) e a produção de estoques que serão realizados economicamente em ciclos posteriores. É recomendável nesses casos o registro no campo “observações” de uma informação sobre a realização econômica de produtos provenientes de estoques gerados em períodos anteriores."]
[null,null,null,"Obs. 2: Os animais que integram o sistema com funções de reprodução ou como processadores de insumos (vacas e cabras leiteiras, galinhas poedeiras, etc.) não são considerados na categoria “estoque de produtos”."]
[null,null,null,"Obs. 3: Como explicado no item “modelização do agroecossistema”, os produtos gerados em atividades de beneficiamento devem ser contabilizados nessa tabela sempre que as matérias-primas utilizadas sejam oriundas predominantemente de um único subsistema. Esse é o caso, por exemplo, da produção de queijo. Como o principal insumo para essa produção é o leite, o processamento deve ser considerado um trabalho organicamente vinculado ao subsistema de criação (ou qualquer outra designação atribuída a ele). No modelo do agroecossistema, essa vinculação estará representada com a inserção das infraestruturas e equipamentos necessários ao processamento no interior do subsistema.\n• Na coluna “Insumos” indicar quantidades (número de unidades) de insumos gerados no período (não necessariamente consumidos – parte do volume gerado alimenta os estoques que serão utilizados nos ciclos produtivos subsequentes)."]
[null,null,null,"» Consumos intermediários:"]
[null,null,null,"Bens de consumo intermediário são os bens econômicos consumidos na produção de outros bens. Para identificar a riqueza gerada na produção dos bens finais (ou valor agregado) é necessário que seja descontado o valor correspondente aos bens consumidos no processo de trabalho. Podem ser produzidos no próprio agroecossistema ou ser adquiridos nos mercados. A tabela está subdividida em duas seções para que essesbens e seus correspondentes valores sejam registrados e processados em separado.\nNa primeira seção da tabela, inserir dados e informações sobre os bens consumidos de produção própria nas seguintes colunas:\n• Item: nome dos insumos consumidos no período\n• Unidade: referência de peso, volume ou medida tradicionalmente\nadotada na região para o item correspondente\n• Valor unitário: Adotar preço de compra\n• Quantidade: Inserir o número de unidades consumidas"]
[null,null,null,"Na segunda seção da tabela, inserir dados e informações sobre os bens consumidos adquiridos nos mercados nas seguintes colunas:\n• Item: Indicar os nomes dos insumos consumidos no período\n• Unidade: Indicar a referência de peso, volume ou medida tradicionalmente adotada na região para o item correspondente\n• Valor unitário: Indicar o valor pelo preço de compra\n• Quantidade: Inserir o número de unidades consumidas\n• Origem: Identificar a procedência do insumo adquirido. Insumos provenientes de mercados socialmente regulados e gerados com base no trabalho de atores sociais da região geográfica em que o agroecossistema está presente são identificados com a letra “T” (para designar “no território”). Insumos adquiridos em mercados convencionais são identificados com a letra “F” (para designar “fora do território”). Essa distinção da origem social dos insumos\ncomprados tem como função identificar o destino dos valores financeiros desembolsados pelo NSGA. Recursos financeiros utilizados para a compra de insumos em mercados socialmente regulados, cuja origem é identificada como “no território”, remuneram o trabalho de atores locais e permanecem circulando e gerando efeitos multiplicadores na economia regional. Já os recursos empregados para a aquisição de insumos em mercados convencionais (“fora do território”) são drenados para fora da região, significando uma transferência de riqueza para atores externos. Nessa discriminação da origem dos bens intermediários consumidos, é preciso atentar para o fato de que os conceitos de “no território” e “fora do território” se referem à “história social” do insumo e não ao local onde foi comprado. Por exemplo: as sementes adquiridas em um mercado na comunidade serão classificadas como “fora do território” caso sejam provenientes de empresas sementeiras; caso tenham sido produzidas localmente por algum(a) agricultor(a) ou organização sua origem será definida como “no território”."]
[null,null,null,"» Pagamento a terceiros:"]
[null,null,null,"Corresponde aos desembolsos efetuados para a remuneração de serviços ou ao pagamento da renda da terra de terceiros. São contabilizados nessa tabela os custos com trabalhadores externos, com assistência técnica, com juros sobre empréstimos contraídos, com o direito de uso de terras de terceiros (sob qualquer regime de acesso – aluguel, meia, arrendamento, etc.)."]
[null,null,null,"• Pagamentos a terceiros não relacionados especificamente ao funcionamento econômico-ecológico de um subsistema são assumidos como custos compartilhados pelo conjunto do agroecossistema.\nPor essa razão, devem ser lançados na aba Agroecossistema."]
[null,null,null,"• Trabalhadores remunerados, mesmo que permanentes, não são considerados membros do NSGA. Por essa razão, o valor dos alimentos fornecidos a esses trabalhadores (caso exista) é contabilizado como parte da remuneração do trabalho."]
[null,null,null,"Inserir dados e informações nas seguintes colunas da tabela:\n• Serviços/Rendas da terra: Indicar os nomes dos serviços remunerados e rendas pagas no período (aluguel, arrendamento, parceria, etc.)"]
[null,null,null,"• Unidade: Indicar a referência tradicionalmente adotada na região para quantificar o serviço"]
[null,null,null,"• Valor unitário: Indicar o valor referencial de uma unidade do serviço ou da renda da terra (somente em caso de ser um valor fixo)"]
[null,null,null,"• Quantidade: Inserir o número de unidades de serviços prestados ou de área de terceiros utilizada."]
[null,null,null,"Obs.: No caso de uso de áreas de terceiros acessadas em regime de parceria (meia, terça, etc.), o valor pago varia segundo o volume da colheita e os preços de mercado das produções na área."]
[null,null,null,"• Origem: Identificar a origem social dos prestadores de serviços e dos proprietários das terras utilizadas. Pagamentos efetuados a atores sociais da mesma região são identificados com a letra “T” (para designar “no território”). Pagamentos efetuados a atores sociais de fora da região são identificados com a letra “F” (para designar “fora do território”). São exemplos comuns de serviços pagos para agentes econômicos de fora do território: taxas de energia elétrica, taxas bancárias, etc. Essa distinção permite identificar o destino dos recursos financeiros desembolsados para pagamento a terceiros. Recursos empregados para remunerar\natores sociais do território permanecerão circulando e gerando efeitos multiplicadores na economia regional. Recursos que remuneram atores de fora do território são drenados para fora da região."]
[null,null,null,"» Entrada de recursos por reciprocidade:"]
[null,null,null,"Um conjunto de recursos necessários ao acionamento do processo de trabalho no subsistema pode ser mobilizado por meio de relações de reciprocidade, ou seja, por relações socialmente reguladas na comunidade sem a necessidade da intermediação de dinheiro. Esses recursos compreendem serviços prestados por terceiros ou insumos gerados fora do agroecossistema. Como circulam por intermédio de fluxos não mercantis, esses recursos não são identificados e dimensionados pela economia agrícola convencional, mesmo que sejam indispensáveis ao\nfuncionamento econômico-ecológico do subsistema."]
[null,null,null,"Inserir dados e informações nas seguintes colunas da tabela:\n• Itens: Indicar os nomes dos recursos mobilizados (serviços ou\ninsumos)\n• Unidade: Indicar a referência tradicionalmente adotada na região\npara quantificar o serviço prestado ou insumo utilizado\n• Valor unitário: Indicar o valor referencial de uma unidade do\nserviço prestado ou do insumo utilizado\n• Quantidade: Inserir o número de unidades de serviços prestados\nou de insumos utilizados"]
[null,null,null,"Indicadores econômicos do agroecossistema (abas azuis)"]
[null,null,null,"Um conjunto de sete abas compõe a seção de apresentação de indicadores econômicos do agroecossistema. Esses indicadores, apresentados em formato numérico e gráfico, expressam a riqueza produzida no agroecossistema no período analisado segundo diferentes composições (estoques, rendas brutas e líquidas) e diferentes recortes analíticos (rendas totais e parciais, monetárias e não monetárias, agrícolas e não agrícolas). Os indicadores também expressam a distribuição proporcional das rendas segundo a contribuição proporcional do trabalho realizado pelos diferentes segmentos sociais do NSGA (homens, mulheres, adultos, jovens) nas diferentes esferas de trabalho. Interpretados em conjunto, esses indicadores permitem dar visibilidade a relações sociais de produção e a formas de integração à natureza ocultadas pelas análises econômicas convencionais."]
[null,null,null,"• Aba Quadro Síntese"]
[null,null,null,"O quadro síntese apresenta informações gerais e indicadores econômicos agregados mais relevantes do agroecossistema. É automaticamente preenchido a partir da importação de informações e dados de outras abas da planilha. A Figura 29 apresenta a estrutura do Quadro Síntese a partir de informações e dados de um agroecossistema hipotético (os mesmos dados serão apresentados na imagens seguintes relacionadas às demais abas do agroecossistema)."]
[null,null,null,"• Aba Indicadores I"]
[null,null,null,"Essa aba apresenta seis tabelas de indicadores econômicos em diferentes níveis de agregação. Os indicadores relacionados referem-se tanto aos subsistemas como ao conjunto do agroecossistema e são compostos a partir do processamento dos dados brutos inseridos nas abas de entrada da planilha."]
[null,null,null,"A primeira tabela apresenta a composição da renda do NSGA em valores absolutos e relativos: rendas agrícolas (produções vegetais e animais e extrativismo) e rendas não agrícolas (pluriatividade e transferências de renda). (Tabela 01)"]
[null,null,null,"A segunda tabela apresenta uma síntese do inventário patrimonial (capital agrário), identificando os valores do capital fundiário e do capital fixo no início e no final do período, bem como a sua variação em termos absolutos (Tabela 2)."]
[null,null,null,"   >>Tabela 03: Produto Bruto e Custos de Produção do agroecossistema e de seus subsistemas:"]
[null,null,null,"A terceira tabela apresenta a composição total e parcial do Produto Bruto e dos Custos de Produção, indicadores econômicos elaborados a partir de um primeiro nível de agregação dos dados brutos lançados nas abas de alimentação da planilha (Tabela 03). Esses indicadores referem-se ao conjunto do agroecossistema e a cada um dos subsistemas e são apresentados de acordo com a composição a seguir."]
[null,null,null,"• Produto Bruto (PB): Corresponde ao somatório de todos os produtos obtidos no agroecossistema durante o exercício. Compreende os itens: bens da produção vegetal e animal e extrativismo vendidos; bens produzidos e autoconsumidos, estocados, doados ou utilizados para fazer pagamentos em espécie, avaliados pelo preço que seria pago caso comprados nos mercados. "]
[null,null,null,"      Obs.: Embora a alteração do valor dos rebanhos pela variação do número de animais, do peso ou dos preços nos mercados (variação de inventário do estoque em relação ao exercício anterior) também integre a contabilidade do Produto Bruto, essa variável não está contemplada na análise proposta."]
[null,null,null,"• Consumos Intermediários (CI): Correspondem aos insumos adquiridos nos mercados que são integralmente consumidos no processo produtivo e que se incorporam nos novos produtos (sementes, adubos, ração para os animais, etc.). Esses valores podem ser gastos no território e fora dele."]
[null,null,null,"      Obs.: Embora a parcela do capital fixo que sofre desgaste e depreciação pelo uso na produção (instrumentos, ferramentas, motores, instalações, etc.) seja contabilizada no cálculo dos consumos intermediários, esta variável não está contemplada na análise proposta. São duas as razões para essa opção metodológica. Em primeiro lugar, o cálculo linear da depreciação anual com base no tempo de vida útil do capital fixo não corresponde à lógica econômica da agricultura familiar para eventual reposição do bem. Em segundo lugar, a incorporação dos valores da depreciação nos consumos intermediários pode gerar desvios e deformações no curto prazo, com riscos de mascarar os dados reais da economia dos agroecossistemas."]
[null,null,null,"• Pagamento a Terceiros (PT): O pagamento a terceiros corresponde à remuneração monetária de serviços de diaristas, assalariados, arrendamento, juros bancários, impostos etc. Esses valores podem ser gastos no território e fora dele."]
[null,null,null,"• Custos de Produção (CP): Corresponde ao somatório dos valores dos consumos intermediários comprados e o pagamento de serviços de terceiros."]
[null,null,null,"• Custos Sistêmicos: Corresponde a pagamentos de serviços de terceiros não atribuídos especificamente a nenhum subsistema."]
[null,null,null,"    >> Tabela 04: Indicadores econômicos do agroecossistema e de seus subsistemas"]
[null,null,null,"A quarta tabela apresenta um conjunto de indicadores elaborados a partir de um segundo nível de processamento dos dados brutos do agroecossistema e de seus subsistemas (Tabela )4). São eles:"]
[null,null,null,"• Renda Bruta (RB = PB – ES): Corresponde ao somatório dos valores das parcelas da produção vendida, autoconsumida, doada e/ ou trocada. Pode ser também aferida pela dedução do valor dos estoques do produto bruto."]
[null,null,null,"• Valor Agregado (VA= RB – CI): Equivale ao somatório dos valores da produção vendida, autoconsumida, doada e/ou trocada (RB) descontado dos custos relacionados aos consumos intermediários. Pode ser entendido também como a nova riqueza gerada pelo trabalho do NSGA."]
[null,null,null,"• Renda Agrícola (RA = VA – PT): É a parcela do VA efetivamente apropriada pelo NSGA. Corresponde ao Valor Agregado deduzido dos pagamentos de serviços de terceiros (no território ou fora dele), ou seja, a remuneração efetiva do trabalho realizado pelo NSGA."]
[null,null,null,"• Valor Agregado Territorial (VAT = VA – CIF): Corresponde à parcela da nova riqueza criada (VA) que permanence no território, gerando efeitos multiplicadores sobre a economia territorial."]
[null,null,null,"• Índice de Apropriação do Valor Agregado (RA/VA x 100): Equivale à porcentagem do Valor Agregado que o NSGA retém após remunerar serviços de terceiros. "]
[null,null,null,"• Índice de Intensidade por Área I (eficiência do trabalho total) (VA/ha): O valor agregado por unidade de área expressa o nível de eficiência ou de intensificação econômica obtido pelo acionamento do conjunto da força de trabalho alocada em atividades produtivas que fazem uso direto do solo do agroecossistema. Portanto, esse indicador não se aplica a duas situações: a) quando o processo de trabalho mobiliza bens naturais em áreas de gestão comunitária e/ou uso compartilhado (rio, pasto apícola, áreas coletivas de agroextrativismo, etc.). Sendo na prática indivisíveis, essas áreas de uso comum não podem ser assimiladas no cálculo da intensificação por unidade de área dos agroecossistemas; b) quando o sistema não faz uso do solo, uma característica comum em criatórios com animais confinados. "]
[null,null,null,"• Índice de Intensidade por Área II (eficiência do trabalho do NSGA) (RA/ha): A renda agrícola por unidade de área expressa o nível de eficiência ou de intensificação obtido pela força de trabalho dos membros do NSGA no manejo da base de recursos do agroecossistema. Pela mesma razão antes explicada, este indicador não se aplica a bens naturais mobilizados em áreas de gestão comunitária e/ou uso compartilhado (rio, áreas coletivas, territórios de uso comum etc.)."]
[null,null,null,"• Renda Agrícola Monetária (RAM = RA – [autoconsumo + doações recebidas]): É a parcela da renda agrícola resultante da venda da produção."]
[null,null,null,"• Rentabilidade Monetária (RM = RAM/ CI + PT): Equivale à renda agrícola monetária recuperada por unidade de custo monetário investido na produção. O indicador não se aplica quando não existe custo monetário pois a renda é igual ao valor agregado. "]
[null,null,null,"• Rentabilidade Monetária Bruta (RMB = RBM/ CI + PT): Equivale à renda bruta monetária recuperada por unidade de custo monetário investido na produção. O indicador não se aplica quando não existe custo monetário pois a renda é igual ao valor agregado. "]
[null,null,null,"Índice de Endogeneidade (IE = VA/RB): Equivale à porcentagem da renda bruta correspondente à riqueza efetivamente gerada pelo trabalho executado na gestão do agroecossistema."]
[null,null,null,"Índice de Mercantilização (IM = CP/CPT): Equivale à razão entre os custos produtivos (CI + PT) e o valor total dos recursos mobilizados pelo processo de trabalho (CI + PT + recursos mobilizados por reciprocidade). Indica o grau de dependência do agroecossistema em relação aos mercados de insumos e serviços."]
[null,null,null,"Tabela 05: Número de horas trabalhadas nos subsistemas e no conjunto do agroecossistema segundo os diferentes segmentos do NSGA"]
[null,null,null,"A quinta tabela reproduz os dados relacionados ao número de horas trabalhadas nos subsistemas e no conjunto do agroecossistema, discriminando esses quantitativos  segundo os diferentes segmentos sociais do NSGA: homem e mulher (correspondem aos pais da família), jovens (homens e mulheres) e outros membros (agregados)\n(Tabela 05)."]
[null,null,null,"  >>Tabela 06: Indicadores de produtividade do trabalho realizado nos subsistemas e no conjunto do agroecossistema"]
[null,null,null,"A sexta tabela apresenta um conjunto de indicadores relacionados à produtividade do trabalho realizado nos subsistemas e no conjunto do agroecossistema (Tabela 06). As cinco primeiras colunas apresentam a repartição do valor agregado segundo as contribuições proporcionais do tempo trabalho de diferentes segmentos do NSGA (VA Mulher; VA Homem; VA Jovens; VA Total Mulheres; VA Total Homens)"]
[null,null,null,"As oito colunas seguintes apresentam o valor agregado correspondente às produções autoconsumidas e às produções mercantilizadas, identificando a contribuição proporcional (absoluta e relativa) do trabalho de homens e mulheres para cada uma delas (VA Autoconsumo/UTF, VA Mercantil/UTF)."]
[null,null,null,"A produtividade do trabalho nos subsistemas e no agroecossistema é indicada por meio de dois indicadores nas duas colunas seguintes: o valor agregado por hora trabalhada (VA/HT); o valor agregado por unidade de trabalho familiar (VA/UTF)."]
[null,null,null,"A coluna seguinte apresenta o nível de escala, ou seja, do número de trabalhadores por área trabalhada (Área/UTF)."]
[null,null,null,"Finalmente, a última coluna da tabela apresenta a renda agrícola por hora trabalhada."]
[null,null,null,"• Aba Indicadores II"]
[null,null,null,"Essa aba apresenta três tabelas com indicadores relacionados ao uso do tempo e à repartição proporcional do valor agregado segundo sexo e esferas de ocupação econômica dos membros do NSGA."]
[null,null,null,"   >> Tabela 07: Tempos totais e parciais de diferentes segmentos do NSGA nas diferentes esferas de ocupação econômica valor percentual proporcional por Unidade de Trabalho Contratada"]
[null,null,null,"A tabela 07 reproduz os dados parciais e totais relacionados ao uso dos tempos (HT/ano) de diferentes segmentos do NSGA (homem, mulher, jovens mulheres, jovens homens, outras, outros, total mulheres, total homens) nas diferentes esferas de ocupação econômica (mercantil e autoconsumo, doméstico e cuidados, participação social e pluriatividade). ???"]
[null,null,null,"   >>Tabela 08: Composição do NSGA e dedicação de tempo de seus membros à gestão do agroecossistema"]
[null,null,null,"   >> Tabela 09: Equivalência do trabalho anual do NSGA em jornadas de oito horas"]
[null,null,null,"A tabela 09 traduz os dados apresentados na primeira tabela,ou seja, os totais de horas trabalhadas anualmente, em jornadas de trabalho com a duração de 8 horas. Por meio desse artifício, converte-se o total anual de trabalho investido na gestão do agroecossistema em número equivalente de jornadas de trabalho  ]ssalariadas."]
[null,null,null,"   >>Tabela 10: Repartição da renda por esfera de ocupação econômica por gênero e geração"]
[null,null,null,"A tabela 10  apresenta a repartição da renda gerada no agroecossistema por esfera de ocupação econômica por gênero e geração . A repartição por esfera de trabalho é discriminada por segmentos do NSGA (homem, mulher, jovens mulheres, jovens homens, outras, outros, total mulheres, total homens). Os dados apresentados nessa tabela dão visibilidade à contribuição proporcional dos diferentes segmentos do NSGA e do trabalho nas diferentes esferas de ocupações econômicas à geração da riqueza gerada no agroecossistema no período de um ano."]
[null,null,null,"• Aba Diagrama Síntese"]
[null,null,null,"A imagem reproduzida na aba Diagrama Síntese representa uma visão agregada dos fluxos econômico-ecológicos no agroecossistema, ou seja, do processo de conversão de recursos em produtos . Do lado dos recursos, são reproduzidos três gráficos de barras empilhadas que representam os equivalentes monetários dos Recursos Produtivos\nMercantis (recursos que entram no processo como mercadorias), os Recursos Reproduzidos (insumos produzidos em ciclos produtivos precedentes) e os Recursos Recebidos (recursos mobilizados por meio de relações de reciprocidade na comunidade). Do lado dos produtos, também são reproduzidos três gráficos de barras: Produtos Vendidos\n(produção comercializada), Produtos Consumidos (autoconsumo pelo NSGA) e Produtos Doados (saída por reciprocidade)."]
[null,null,null,"Os Circuitos Mercantilizados representam os fluxos econômico-ecológicos que mobilizam os Recursos Produtivos Mercantis e os Produtos Vendidos e os Circuitos Não Mercantilizados mobilizam os Recursos Reproduzidos, os Recursos Recebidos os Produtos Consumidos e os Produtos Doados."]
[null,null,null,"Duas relações econômicas representadas no diagrama expressam as lógicas de reprodução econômico-ecológica do agroecossistema adotadas pelos NSGA. A primeira se refere ao balanço entre as receitas advindas dos produtos vendidos e as despesas incorridas com a mobilização de fatores de produção nos mercados (recursos produtivos mercantis). Esse balanço, que corresponde à renda agrícola monetária (RAM), varia em função do custo dos recursos mercantis consumidos, da eficiência técnica na conversão dos recursos em produtos e do preço dos produtos comercializados. A rentabilidade monetária, ou seja, o percentual de remuneração do capital financeiro investido na produção (RAM/CI+PT) é um indicador diretamente derivado desse balanço. Embora em qualquer situação esse indicador seja de grande importância na definição das estratégias de reprodução adotadas pelos NSGA, nos agroecossistemas geridos segundo estilos empresariais ele assume um papel central uma vez que\nseus fluxos econômico-ecológicos são comandados essencialmente pela “lógica dos mercados”, assumindo os circuitos não mercantis menor peso relativo."]
[null,null,null,"A segunda relação corresponde ao balanço entre os recursos produtivo mercantis e os recursos reproduzidos pelo processo de trabalho no agroecossistema (reciprocidade ecológica) e/ou recebidos de terceiros a partir de relações de troca não mercantilizada estabelecidas na comunidade (reciprocidade social). Nos estilos de gestão de maior nível de campesinidade, uma porcentagem relativamente maior de recursos mobilizados para o processo de trabalho é proveniente da base de recursos autocontrolada, o que implica uma maior autonomia em relação aos mercados de insumos e serviços. Esse maior grau relativo de autonomia (ou de dependência) em relação aos mercados de fatores de produção pode ser identificado pelo índice de mercantilização (IM = CP/CPT, onde CP corresponde aos custos dos recursos que entram no processo de produção como mercadorias e CPT ao valor dos recursos produtivos totais, ou seja, a soma do custo das mercadorias com os valores dos recursos mobilizados da base de recursos autocontrolada). "]
[null,null,null,"Combinadas, as duas relações expressam diferenças marcantes entre os estilos de gestão econômico-ecológica dos agroecossistemas. Nos estilos dependentes dos mercados (mais empresariais), os índices de mercantilização são maiores (mais próximos de 1), enquanto nos estilos relativamente autônomos e historicamente garantidos (maior campesinidade) os índices de mercantilização tendem a ser menores (mais próximos de 0). O progressivo aumento da base de recursos autocontrolada (em termos quantitativos e qualitativos), bem como do nível de eficiência técnica da conversão dos recursos em produtos são elementos decisivos para o aumento da rentabilidade dos agroecossistemas geridos por lógicas camponesas. Já nos estilos empresariais de gestão, os níveis de rentabilidade do agroecossistema são definidos essencialmente pelo cálculo da relação custo/benefício expressa em termos monetários."]
[null,null,null,"Em resumo: os índices apresentados nesse diagrama são uma expressão sintética dos estilos de gestão do agroecossistema já que refletem lógicas e objetivos distintos no planejamento do processo de trabalho do NSGA. Nos agroecossistemas que apresentam maiores índices de mercantilização (estilos mais empresariais), o planejamento visa predominantemente o alcance de maior eficiência econômica (em termos monetários) no curto prazo. Além de focar as necessidades de consumo imediato dos NSGA, o planejamento nos estilos de gestão de maior campesinidade (menores índices de mercantilização) incorpora também objetivos de médio e longo prazos relacionados à ampliação da base de recursos autocontrolada e ao aprimoramento da eficiência técnica do processo de conversão. Isso implica dizer que a melhoria dos resultados econômicos dos agroecossistemas de maior campesinidade é obtida por trajetórias de desenvolvimento que vinculam organicamente o trabalho produtivo e o trabalho reprodutivo. Em termos analíticos, diz-se que correspondem a trajetórias de intensificação produtiva, ou seja, melhoria nos rendimentos produtivos por objeto de trabalho."]
[null,null,null,"Maiores índices de mercantilização indicam que parte importante do trabalho de reprodução no agroecossistema é externalizado e que a manutenção e a contínua ampliação da base de recursos autocontrolada são um aspecto secundário (senão irrelevante) no planejamento do processo de trabalho. Dada a elevada dependência das relações mercantis, os índices de rentabilidade nesses agroecossistemas costumam variar significativamente em função da alta volatilidade dos mercados de fatores de produção (a montante) e de produtos agrícolas (a jusante). Para compensar índices de rentabilidade relativamente baixos e obter níveis adequados de renda, os NSGA são levados a ingressar em trajetórias de desenvolvimento baseadas na lógica do aumento de escala, isto é, aumentar o número de objetos de trabalho (sobre os conceitos de intensidade e escala ver página 70). "]
[null,null,null,"• Aba Gráficos Renda"]
[null,null,null,"Essa aba apresenta graficamente os resultados econômicos do conjunto do agroecossistema e de seus subsistemas segundo diferentes indicadores e composições."]
[null,null,null,"O gráfico 1 apresenta a composição da renda total dos NSGA segundo suas origens: transferências de renda (políticas sociais, transferências de parentes, outras); pluriatividade (venda de serviço a terceiros); rendas agrícolas (rendas geradas pelo trabalho de manejo do agroecossistema)."]
[null,null,null,"Os gráficos 2 e 3 representam o produto bruto e as rendas produzidas no conjunto do agroecossistema segundo diferentes composições. O primeiro se refere ao produto bruto total e o segundo ao produto bruto proporcional a uma área de um hectare. Nos dois gráficos, os valores estão apresentados em colunas empilhadas sucessivas segundo as seguintes composições:"]
[null,null,null,"• produto bruto (coluna 1): corresponde ao valor bruto da produção total realizada no período de um ano;"]
[null,null,null,"• estoque + trocas e doações + autoconsumo + venda (coluna 2): apresenta a discriminação do produto bruto segundo as diferentes destinações da produção;"]
[null,null,null,"• valor agregado + consumos intermediários (coluna 3): refere-se à discriminação da renda bruta entre a riqueza gerada pelo trabalho do NSGA (VA) e o valor dos insumos adquiridos nos mercados (CI);"]
[null,null,null,"• valor agregado territorial + consumos intermediários fora do território (coluna 4): refere-se à discriminação da renda bruta entre a riqueza gerada pelo trabalho (VA) e o valor dos insumos adquiridos nos mercados convencionais (fora do território) (CIFT);"]
[null,null,null,"• renda agrícola + custos produtivos (coluna 5): corresponde à discriminação da renda bruta entre a renda agrícola (RA), ou seja, à parcela da renda que efetivamente remunera o trabalho do NSGA, e os custos produtivos (CP), ou seja, os custos com consumos intermediários e serviços de terceiros;"]
[null,null,null,"• renda agrícola monetária + custos produtivos (coluna 6): corresponde à discriminação da renda bruta monetária entre a renda agrícola monetária (RAM), ou seja, à parcela que remunera monetariamente o trabalho do NSGA, e os custos produtivos (CP), ou seja, os custos com consumos intermediários e serviços de terceiros (CP) "]
[null,null,null,"Os gráficos  4 ao 7 nessa aba apresentam a composição do produto bruto e da renda gerada no agroecossistema e nos seus subsistemas segundo diferentes categorias econômicas. O gráfico 4 representa a composição do produto bruto (PB) segundo os valores produzidos destinados ao estoque, a trocas e doações, ao autoconsumo e à venda. O gráfico 5 apresenta a composição da renda bruta (RB) segundo os valores dos consumos intermediários e do valor agregado. O gráfico 6 apresenta a composição da renda bruta segundo os valores dos consumos intermediários fora do território (CIFT) e do valor agregado territorial (VAT). O gráfico 7 apresenta a composição da renda bruta monetária (RBM) segundo os valores da renda agrícola monetária (RAM) e dos custos produtivos (CP). "]
[null,null,null,"Os quatro gráficos seguintes (de 8 a 11) apresentam as diferente  produções segundo suas destinações. O gráfico 8 (colunas empilhadas) discrimina o valor das produções destinadas à venda, ao autoconsumo, ao estoque e às doações. O gráfico 9 apresenta a mesma composição do gráfico 8 em formato de pizza. O gráfico 10 (pizza) apresenta a composição das rendas das produções vendidas e o gráfico 11 (pizza) a composição das rendas das produções autoconsumidas. "]
[null,null,null,"Os quatro gráficos seguintes (de linha) representam níveis de intensidade de fatores de produção empregados no agroecossistema e em seus subsistemas. As inclinações das seções da linha representam os diferentes níveis de intensidade dos subsistemas correspondentes a cada seção. Nesse sentido, a inclinação da linha imaginária que liga os pontos extremos da curva representa o nível de intensidade do fator de produção (terra ou trabalho) do conjunto do agroecossistema. "]
[null,null,null,"O primeiro gráfico apresenta o nível efetivo de intensidade do fator terra, ou seja, a riqueza gerada na área efetivamente trabalhada pelo NSGA."]
[null,null,null,"O segundo gráfico apresenta o nível proporcional de intensidade do fator terra, isto é, a riqueza gerada proporcionalmente a uma área de um hectare. "]
[null,null,null,"O terceiro gráfico apresenta o nível de intensidade do fator trabalho, isto é, a riqueza gerada pelo trabalho realizado no agroecossistema e em seus subsistemas."]
[null,null,null,"O quarto gráfico apresenta o nível de intensidade do fator terra por unidade de trabalho, ou seja, a produtividade combinada dos recursos terra e trabalho. Em outros termos, esse gráfico representa a eficiência técnica da conversão de ambos os recursos na produção da riqueza gerada no agroecossistema e nos seus subsistemas ."]
[null,null,null,"• Aba Gráficos Trabalho"]
[null,null,null,"Por meio de nove gráficos de colunas empilhadas, esta aba apresenta a repartição proporcional do valor agregado gerado no agroecossistema por esfera de ocupação econômica, por gênero e por geração. "]
[null,null,null,"O primeiro gráfico apresenta os valores correspondentes à riqueza gerada no agroecossistema pelo trabalho do casal responsável pelo NSGA, distinguindo entre a contribuição proporcional da mulher e do homem nas diferentes esferas de ocupação (aplicável caso o NSGA seja uma família e seja coordenada por um casal formado por um homem e uma mulher).      "]
[null,null,null,"O segundo gráfico (à direita) apresenta a repartição proporcional da renda gerada por gênero e por esfera de trabalho, distinguindo entre os diferentes grupos que integram o NSGA (homem e mulher - corresponde ao casal responsável pelo NSGA; jovens homens e mulheres; outros - podendo ser idosos, agregados, etc)."]
[null,null,null,"O terceiro gráfico apresenta os valores proporcionais da riqueza gerada pelo trabalho das mulheres e homens integrantes do NSGA segundo as esferas de ocupação."]
[null,null,null,"O quarto gráfico apresenta a repartição proporcional da renda por esfera de trabalho e por gênero."]
[null,null,null,"O quinto gráfico apresenta uma visão similar à do gráfico anterior, mas apresentando a alocação proporcional do tempo de trabalho de homens e mulheres integrantes do NSGA às diferentes esferas de ocupação (o gráfico apresenta a proporção dos tempos alocados por mulheres e homens para perfazerem o montante de horas trabalhadas correspondente a uma unidade de trabalho contratada)."]
[null,null,null,"O sexto gráfico apresenta a contribuição do tempo de trabalho, em equivalentes de jornadas de oito horas, de homens e de mulheres, de adultos e de jovens, segundo as esferas de trabalho . "]
[null,null,null,"O sétimo gráfico apresenta a contribuição proporcional do trabalho de mulheres e homens à geração do valor agregado correspondente à produção autoconsumida do conjunto do agroecossistema e dos seus subsistemas."]
[null,null,null,"O oitavo gráfico apresenta a contribuição proporcional do trabalho de mulheres e homens à geração do valor agregado correspondente à produção mercantilizada do conjunto do agroecossistema e dos seus subsistemas."]
[null,null,null,"O nono gráfico apresenta os dois gráficos anteriores lado a lado, proporcionando uma visualização mais clara sobre a contribuição proporcional do trabalho de mulheres e homens à produção autoconsumida e mercantilizada gerada no conjunto do agroecossistema e nos seus subsistemas."]
[null,null,null,"    • Aba Gráficos Reciprocidade"]
[null,null,null,"Os valores dos recursos materiais e aos serviços mobilizados para o processo de trabalho sem a intermediação de relações mercantilizadas são apresentadas nos dois gráficos reproduzidos nesta aba segundo os seus equivalentes monetários."]
[null,null,null,"O primeiro gráfico (reciprocidade ecológica) apresenta os valores dos insumos produzidos no agroecossistema a partir da interação recíproca entre o trabalho dos membros do NSGA e o trabalho da natureza. O gráfico é composto por quatro barras correspondentes, respectivamente, aos insumos produzidos e estocados em ciclos de produção anteriores, aos insumos produzidos durante o ciclo anual analisado, aos insumos de produção própria consumidos no ciclo analisado e aos insumos estocados para uso em ciclos produtivos posteriores. "]
[null,null,null,"O segundo gráfico (reciprocidade social) apresenta os valores de produtos e serviços intercambiados por meio de relações de reciprocidade comunitária. Apresenta duas barras, sendo a primeira correspondente aos produtos e serviços recebidos de terceiros e a segunda aos produtos e serviços doados. "]

{"sheet":"Agroecossistema","index":10,"n_rows":152,"n_cols":17,"rows_kept":152,"cut":false,"hidden":false,"merged":[[7,15,8,16],[81,12,82,15],[47,12,49,15],[38,7,38,9],[7,13,8,14],[1,1,1,16],[3,13,5,14],[124,7,124,8],[124,1,124,4],[18,13,18,16],[43,11,43,15],[44,11,44,15],[61,1,61,2],[66,3,66,6],[59,12,59,15],[62,12,62,15],[81,7,81,9],[81,10,81,11],[33,11,33,15],[34,11,34,15],[35,11,35,15],[36,11,36,15],[37,11,37,15],[88,1,88,2],[86,1,86,2],[63,1,63,2],[81,3,81,6],[42,11,42,15],[18,1,19,2],[20,1,22,1],[21,13,21,16],[22,13,22,16],[24,1,25,1],[76,12,76,15],[77,12,77,15],[72,12,72,15],[75,12,75,15],[71,12,71,15],[68,12,68,15],[64,12,64,15],[65,12,65,15],[74,12,74,15],[66,12,67,15],[71,1,71,2],[72,1,72,2],[24,11,25,15],[26,11,26,15],[59,1,59,2],[50,12,50,15],[54,1,54,2],[62,1,62,2],[60,1,60,2],[70,12,70,15],[56,12,56,15],[66,7,66,9],[73,12,73,15],[52,12,52,15],[66,10,66,11],[54,12,54,15],[60,12,60,15],[55,12,55,15],[58,12,58,15],[61,12,61,15],[63,12,63,15],[69,12,69,15],[131,1,131,2],[127,1,127,2],[128,1,128,2],[102,1,102,2],[105,1,105,2],[106,1,106,2],[107,1,107,2],[104,1,104,6],[108,1,108,2],[109,1,109,2],[110,1,110,2],[124,5,124,6],[129,1,129,2],[130,1,130,2],[132,1,132,2],[139,1,139,2],[38,3,38,6],[24,2,24,10],[33,3,33,6],[51,12,51,15],[47,7,48,9],[47,10,48,11],[53,12,53,15],[57,12,57,15],[67,1,67,2],[64,1,64,2],[57,1,57,2],[51,1,51,2],[55,1,55,2],[56,1,56,2],[52,1,52,2],[39,11,39,15],[40,11,40,15],[41,11,41,15],[91,1,91,2],[92,1,92,2],[125,1,125,2],[126,1,126,2],[151,1,151,2],[133,1,133,2],[134,1,134,2],[135,1,135,2],[136,1,136,2],[137,1,137,2],[138,1,138,2],[142,1,142,2],[143,1,143,2],[144,1,144,2],[141,1,141,2],[140,1,140,2],[150,1,150,2],[145,1,145,2],[146,1,146,2],[147,1,147,2],[149,1,149,2],[148,1,148,2],[17,11,17,15],[11,2,11,5],[3,2,3,5],[10,2,10,5],[5,2,5,5],[50,1,50,2],[19,13,19,16],[7,1,8,1],[41,3,41,6],[49,1,49,2],[32,1,44,2],[32,3,32,6],[35,3,35,6],[36,3,36,6],[40,3,40,6],[34,3,34,6],[42,3,42,6],[39,3,39,6],[37,3,37,6],[44,3,44,6],[47,1,48,2],[47,3,48,6],[20,13,20,16],[14,3,14,5],[27,11,27,15],[28,11,28,15],[29,11,29,15],[101,12,101,15],[94,1,94,2],[95,1,95,2],[96,1,96,2],[97,1,97,2],[98,1,98,2],[89,1,89,2],[91,12,91,15],[100,1,100,2],[90,1,90,2],[93,1,93,2],[92,12,92,15],[93,12,93,15],[98,12,98,15],[100,12,100,15],[78,12,78,15],[79,12,79,15],[95,12,95,15],[53,1,53,2],[58,1,58,2],[43,3,43,6],[102,12,102,15],[101,1,101,2],[94,12,94,15],[96,12,96,15],[97,12,97,15],[75,1,75,2],[76,1,76,2],[77,1,77,2],[79,1,79,2],[80,12,80,15],[87,1,87,2],[83,1,83,2],[84,12,84,15],[85,12,85,15],[86,12,86,15],[83,12,83,15],[85,1,85,2],[81,1,81,2],[87,12,87,15],[89,12,89,15],[88,12,88,15],[99,12,99,15],[99,1,99,2],[90,12,90,15],[15,3,15,5],[13,3,13,5],[111,1,111,2],[112,1,112,2],[113,1,113,2],[121,1,121,2],[120,1,120,2],[114,1,114,2],[115,1,115,2],[116,1,116,2],[117,1,117,2],[118,1,118,2],[119,1,119,2],[84,1,84,2],[78,1,78,2],[82,1,82,2],[66,1,66,2],[80,1,80,2],[69,1,69,2],[73,1,73,2],[68,1,68,2],[74,1,74,2],[65,1,65,2],[70,1,70,2]]}
[]
[null,"ENTRADA DE DADOS DO AGROECOSSISTEMA"]
[]
[null,"Família","Manoel Inacio/Adenice Vieira",null,null,null,null,null,null,null,null,null,null,"Ciclo Anual de Referência",null,"Inicio","Fim"]
[null,null,null,null,null,null,null,null,null,null,null,null,null,null,null,"mês/ano","mês/ano"]
[null,"Comunidade","Tanque de Pedra / Sitio Balaio",null,null,null,null,null,null,null,null,null,null,null,null,"2015-11-01","2016-11-01"]
[null,null,null,"graus","minutos","segundos"]
[null,"Coordenadas  geográficas","Lat.",null,null,null,null,null,null,null,null,null,null,"Data de Coleta dos dados:",null,"2016-12-01"]
[null,null,"Long."]
[]
[null,"Município","Nossa Senhora do Glória"]
[null,"Estado","Sergipe"]
[]
[null,"Área Total",{"$f":"C15+C16","v":7},"Observações"]
[null,"Próprias",6,"23 tarefas"]
[null,"Terceiros/comunitária",1,"ARRENDAMENTO"]
[]
[]
[null,"Composição do NSGA",null,"Mulher","Homem","Jovens Mulheres","Jovens Homens","Outras","Outros","Crianças","Total Mulheres","Total Homens","TOTAL","Observações"]
[null,null,null,1,1,7,6,null,null,null,{"$f":"D20+F20+H20","v":8},7,{"$f":"K20+L20+J20","v":15}]
[null,"Equivalente em Unidades de Trabalho Familiar (UTF)","UTF Agroecossitema",1,1,1.6,1,null,null,null,2.6,2,{"$f":"E21+D21+G21+F21+I21+H21","v":4.5999999999999996}]
[null,null,"UTF   Pluriatividade",null,null,null,null,null,null,null,0,0,{"$f":"E22+D22+G22+F22+I22+H22","v":0}]
[null,null,"UTF Total",{"$f":"D21+D22","v":1},1,1.6,1,0,0,null,2.6,2,{"$f":"E23+D23+G23+F23+I23+H23","v":4.5999999999999996}]
[]
[null,"Esferas de ocupação","Tempo estimado de ocupação por esfera de trabalho (Horas/Ano) ",null,null,null,null,null,null,null,null,"Observações"]
[null,null,"Mulher","Homem","Jovens Mulheres","Jovens Homens","Outras","Outros","TOTAL MULHERS","TOTAL HOMENS","TOTAL"]
[null,"Trabalho doméstico e de cuidados:",{"$f":"8*365","v":2920},{"$f":"16*12","v":192},{"$f":"6*365","v":2190},null,null,null,{"$f":"C27+E27+G27","v":5110},192,{"$f":"SUM(C27:H27)","v":5302}]
[null,"Participação social:",12,0,0,null,null,null,12,0,{"$f":"SUM(C28:H28)","v":12}," 1 hora no mês"]
[null,"Pluriatividade:",null,null,null,null,null,null,0,0,{"$f":"SUM(C29:H29)","v":0}]
[null,"Total ",{"$f":"SUM(C27:C29)","v":2932},{"$f":"SUM(D27:D29)","v":192},2190,0,0,0,5122,192,5314]
[]
[null,null,null,null,null,null,null,null,null,null,"Total"]
[null,"Rendas Não Agrícolas",null,"Pluriatividade",null,null,null,"Unidade","Valor Unitário","Qtdade",{"$f":"SUM(K34:K38)","v":4320},"Observações:"]
[null,null,null,"atividades externa",null,null,null,"diaria",30,{"$f":"12*12","v":144},{"$f":"I34*J34","v":4320}]
[null,null,null,null,null,null,null,null,null,null,{"$f":"I35*J35","v":0}]
[null,null,null,null,null,null,null,null,null,null,{"$f":"I36*J36","v":0}]
[null,null,null,null,null,null,null,null,null,null,{"$f":"I37*J37","v":0}]
[null,null,null,null,null,null,null,null,null,null,{"$f":"I38*J38","v":0}]
[null,null,null,"Transferências de Renda",null,null,null,null,null,null,{"$f":"SUM(K40:K44)","v":11440},"Observações:"]
[null,null,null,"Aposentadoria rural",null,null,null,"mensal",880,12,{"$f":"I40*J40","v":10560}]
[null,null,null,"Bolsa família",null,null,null,"mensal",110,8,{"$f":"I41*J41","v":880}]
[null,null,null,null,null,null,null,null,null,null,{"$f":"I42*J42","v":0}]
[null,null,null,null,null,null,null,null,null,null,{"$f":"I43*J43","v":0}]
[null,null,null,null,null,null,null,null,null,null,{"$f":"I44*J44","v":0}]
[null,null,null,"Total Rendas Não agrícolas",null,null,null,null,null,null,{"$f":"K33+K39","v":15760}]
[]
[]
[null,"Inventário Patrimonial (Capital agrário)",null,"Início do Período",null,null,null,"Final do Período",null,null,"Variação no Peróodo",null,"OBSERVAÇÕES"]
[]
[null,"Capital Fundiário",null,"Unidade","Valor Unitário","Qtde","Valor Total","Valor Unitário","Qtde","Valor Total","Qtde","Valor Total"]
[null,"Propriedade",null,"tarefa",3000,23,{"$f":"F51*E51","v":69000},3000,23,{"$f":"I51*H51","v":69000},{"$f":"I51-F51","v":0},{"$f":"J51-G51","v":0}]
[null,"Casa  1",null,"Unidade",{"$f":"300*150","v":45000},1,45000,45000,1,45000,0,0]
[null,"galinheiro",null,"Unidade",2500,1,2500,2500,1,2500,0,0]
[null,"Cercas",null,"estacas",1416,4,5664,1416,4,5664,0,0]
[null,"Aprisco (novo)",null,"Unidade",2500,1,2500,2500,1,2500,0,0]
[null,"Pocilga",null,"estacas",2400,1,2400,2400,1,2400,0,0]
[null,"Curral",null,"Unidade",2000,1,2000,2000,1,2000,0,0]
[null,"Arame",null,"m",0.5,4500,2250,0.5,4500,2250,0,0]
[null,null,null,null,null,null,{"$f":"F59*E59","v":0},null,null,{"$f":"I59*H59","v":0},0,0]
[null,null,null,null,null,null,0,null,null,0,0,0]
[null,null,null,null,null,null,0,null,null,0,0,0]
[null,null,null,null,null,null,0,null,null,0,0,0]
[null,null,null,null,null,null,0,null,null,0,0,0]
[null,null,null,null,null,null,0,null,null,0,0,0]
[null,null,null,null,null,null,0,null,null,0,0,0]
[null,"Total - Capital Fundiário",null,null,null,null,{"$f":"SUM(G51:G65)","v":131314},null,null,{"$f":"SUM(J51:J65)","v":131314},null,{"$f":"SUM(L51:L65)","v":0}]
[null,"Capital Fixo (CF)",null,"Início do Período",null,null,null,"Final do Período",null,null,"Variação no Peróodo",null,"OBSERVAÇÕES"]
[null,"CF Equipamentos",null,"Unidade","Valor Unitário","Qtde","Valor Total","Valor Unitário","Qtde","Valor Total","Qtde","Valor"]
[null,"Forrageira",null,"Unidade",1200,1,{"$f":"F69*E69","v":1200},1200,1,{"$f":"I69*H69","v":1200},{"$f":"I69-F69","v":0},{"$f":"J69-G69","v":0}]
[null,"carroça",null,"Unidade",1200,1,1200,1200,1,1200,0,0]
[null,"Bomba centrifuga 1  (comodato embrapa)",null,"unidade",900,1,900,900,1,900,0,0]
[null,"matraca",null,"Unidade",50,2,100,50,2,100,0,0]
[null,null,null,null,null,null,{"$f":"F73*E73","v":0},null,null,{"$f":"I73*H73","v":0},0,0]
[null,null,null,null,null,null,0,null,null,0,0,0]
[null,null,null,null,null,null,0,null,null,0,0,0]
[null,null,null,null,null,null,0,null,null,0,0,0]
[null,null,null,null,null,null,0,null,null,0,0,0]
[null,null,null,null,null,null,0,null,null,0,0,0]
[null,null,null,null,null,null,0,null,null,0,0,0]
[null,null,null,null,null,null,0,null,null,0,0,0]
[null,"Total - CF Equipamentos",null,null,null,null,{"$f":"SUM(G69:G80)","v":3400},null,null,{"$f":"SUM(J69:J80)","v":3400},null,{"$f":"SUM(L69:L80)","v":0}]
[null,"Capital Fixo (CF)",null,"Início do Período",null,null,null,"Final do Período",null,null,"Variação no Peróodo"]
[null,"CF  Vivo (Semoventes)",null,"Unidade","Valor Unitário","Qtde","Valor Total","Valor Unitário","Qtde","Valor Total","Qtde","Valor"]
[null,"vacas",null,"Unidade",2500,3,{"$f":"F84*E84","v":7500},2500,3,{"$f":"I84*H84","v":7500},{"$f":"I84-F84","v":0},0]
[null,"Suínos",null,"kg",6.6,440,2904,6.6,440,2904,0,0,"1 reprodutor 2 porcas e 3 pequenos"]
[null,"galinha",null,"Unidade",30,8,240,30,8,240,0,0]
[null,"garrote",null,"unidade",800,1,800,800,0,0,-1,-800]
[null,"pinto",null,"Unidade",25,5,125,25,5,125,0,0]
[null,"frango",null,"unidade",25,20,500,25,20,500,0,0]
[null,"galo",null,"unidade",15,2,30,15,2,30,0,0]
[null,"pato",null,"unidade",25,5,125,25,5,125,0,0]
[null,"ovelha",null,"unidade",350,1,350,350,1,350,0,0]
[null,"cavalo",null,"unidade",1200,1,1200,1200,1,1200,0,0]
[null,"jegue",null,"unidade",100,1,100,100,1,100,0,0]
[null,null,null,null,null,null,{"$f":"F95*E95","v":0},null,null,{"$f":"I95*H95","v":0},{"$f":"I95-F95","v":0},{"$f":"J95-G95","v":0}]
[null,null,null,null,null,null,0,null,null,0,0,0]
[null,null,null,null,null,null,0,null,null,0,0,0]
[null,null,null,null,null,null,0,null,null,0,0,0]
[null,null,null,null,null,null,0,null,null,0,0,0]
[null,null,null,null,null,null,0,null,null,0,0,0]
[null,null,null,null,null,null,0,null,null,0,0,0]
[null,"Total - Capital Fixo Vivo (Semoventes)",null,null,null,null,{"$f":"SUM(G84:G101)","v":13874},null,null,{"$f":"SUM(J84:J101)","v":13074},null,{"$f":"SUM(L84:L101)","v":-800}]
[null,"Total Geral",null,null,null,null,{"$f":"G81+G102+G66","v":148588},null,null,{"$f":"J81+J102+J66","v":147788},null,{"$f":"L81+L102+L66","v":-800}]
[]
[null,"Pagamento a Terceiros  (custos sistêmicos)"]
[null,"Itens",null,"Unidade","Valor Unitário","Qtde","Valor Total"]
[null,"Mensalidade associação",null,"mensalidade",4,12,{"$f":"F107*E107","v":48}]
[null,"água",null,"mensalidade",31,12,372]
[null,"Energia",null,"kW",40,12,480]
[null,null,null,null,null,null,0]
[null,null,null,null,null,null,0]
[null,null,null,null,null,null,0]
[null,null,null,null,null,null,0]
[null,null,null,null,null,null,0]
[null,null,null,null,null,null,0]
[null,null,null,null,null,null,0]
[null,null,null,null,null,null,0]
[null,null,null,null,null,null,0]
[null,null,null,null,null,null,0]
[null,null,null,null,null,null,0]
[null,null,null,null,null,null,0]
[null,"Total pagamento a terceiros",null,null,null,null,{"$f":"SUM(G107:G121)","v":900}]
[]
[]
[null,"Reserva de insumos",null,null,null,"Acumulados no Período Anterior",null,"Final do Período"]
[null,null,null,"Unidade","Valor Unitário","Qtde","Valor Total","Qtde","Valor Total"]
[null,"silagem",null,"ton",300,10,{"$f":"F127*E127","v":3000},6,{"$f":"E127*H127","v":1800}]
[null,null,null,null,null,null,{"$f":"F128*E128","v":0},null,{"$f":"E128*H128","v":0}]
[null,null,null,null,null,null,0,null,0]
[null,null,null,null,null,null,0,null,0]
[null,null,null,null,null,null,0,null,0]
[null,null,null,null,null,null,0,null,0]
[null,null,null,null,null,null,0,null,0]
[null,null,null,null,null,null,0,null,0]
[null,null,null,null,null,null,0,null,0]
[null,null,null,null,null,null,0,null,0]
[null,null,null,null,null,null,0,null,0]
[null,null,null,null,null,null,0,null,0]
[null,null,null,null,null,null,0,null,0]
[null,null,null,null,null,null,0,null,0]
[null,null,null,null,null,null,0,null,0]
[null,null,null,null,null,null,0,null,0]
[null,null,null,null,null,null,0,null,0]
[null,null,null,null,null,null,0,null,0]
[null,null,null,null,null,null,0,null,0]
[null,null,null,null,null,null,0,null,0]
[null,null,null,null,null,null,0,null,0]
[null,null,null,null,null,null,0,null,0]
[null,null,null,null,null,null,0,null,0]
[null,null,null,null,null,null,0,null,0]
[null,null,null,null,null,null,0,null,{"$f":"E151*H151","v":0}]
[null,"Total",null,null,null,null,{"$f":"SUM(G127:G151)","v":3000},null,{"$f":"SUM(I127:I151)","v":1800}]

{"sheet":"SUB. 1","index":11,"n_rows":125,"n_cols":21,"rows_kept":125,"cut":false,"hidden":false,"merged":[[86,1,86,3],[48,1,48,3],[49,1,49,3],[45,1,45,3],[44,1,44,3],[46,1,46,3],[59,1,59,3],[55,8,55,12],[56,8,56,12],[48,8,48,12],[52,8,52,12],[53,8,53,12],[83,9,84,12],[84,1,84,3],[79,9,81,12],[80,1,80,3],[81,1,81,3],[79,1,79,3],[81,4,81,6],[83,1,83,8],[85,9,85,12],[79,4,79,6],[80,4,80,6],[85,1,85,3],[116,1,116,3],[116,8,116,12],[115,1,115,3],[115,8,115,12],[106,1,106,3],[106,8,106,12],[117,1,117,3],[117,8,117,12],[121,1,121,3],[121,8,121,12],[118,1,118,3],[118,8,118,12],[119,1,119,3],[119,8,119,12],[120,1,120,3],[120,8,120,12],[111,1,111,3],[111,8,111,12],[112,1,112,3],[112,8,112,12],[113,1,113,3],[113,8,113,12],[114,1,114,3],[114,8,114,12],[107,1,107,3],[107,8,107,12],[108,1,108,3],[108,8,108,12],[109,1,109,3],[109,8,109,12],[110,1,110,3],[110,8,110,12],[98,1,98,3],[98,9,98,12],[99,1,99,3],[99,9,99,12],[100,9,102,12],[104,8,105,12],[105,1,105,3],[100,1,100,3],[104,1,104,7],[100,4,100,6],[101,4,101,6],[102,4,102,6],[102,1,102,3],[101,1,101,3],[93,9,93,12],[94,1,94,3],[94,9,94,12],[95,1,95,3],[95,9,95,12],[97,1,97,3],[97,9,97,12],[96,1,96,3],[96,9,96,12],[93,1,93,3],[88,9,88,12],[89,1,89,3],[89,9,89,12],[90,1,90,3],[90,9,90,12],[92,1,92,3],[92,9,92,12],[91,1,91,3],[91,9,91,12],[88,1,88,3],[86,9,86,12],[50,1,50,3],[69,9,69,12],[70,1,70,3],[70,9,70,12],[87,1,87,3],[87,9,87,12],[51,1,51,3],[52,1,52,3],[53,1,53,3],[54,1,54,3],[76,9,76,12],[77,9,77,12],[78,9,78,12],[69,1,69,3],[74,1,74,3],[78,1,78,3],[55,1,55,3],[75,1,75,3],[77,1,77,3],[76,1,76,3],[71,1,71,3],[71,9,71,12],[72,1,72,3],[72,9,72,12],[73,1,73,3],[73,9,73,12],[64,1,64,3],[64,9,64,12],[65,1,65,3],[65,9,65,12],[66,1,66,3],[66,9,66,12],[67,1,67,3],[67,9,67,12],[68,1,68,3],[68,9,68,12],[59,9,59,12],[60,1,60,3],[60,9,60,12],[61,1,61,3],[61,9,61,12],[62,1,62,3],[62,9,62,12],[63,1,63,3],[63,9,63,12],[58,1,58,3],[40,1,40,3],[29,1,29,3],[29,20,29,21],[30,1,30,3],[30,20,30,21],[31,1,31,3],[31,20,31,21],[32,1,32,3],[41,1,41,3],[33,20,33,21],[32,20,32,21],[44,8,44,12],[45,8,45,12],[47,8,47,12],[47,1,47,3],[48,15,48,16],[49,15,49,16],[57,1,57,8],[39,1,39,7],[56,1,56,3],[43,1,43,3],[38,1,38,12],[39,8,40,12],[28,20,28,21],[25,20,25,21],[26,20,26,21],[27,20,27,21],[34,1,34,3],[34,20,34,21],[35,1,35,3],[35,20,35,21],[36,1,36,3],[36,20,36,21],[28,1,28,3],[33,1,33,3],[49,8,49,12],[50,8,50,12],[57,9,58,12],[74,9,74,12],[20,20,20,21],[26,1,26,3],[27,1,27,3],[15,16,16,17],[15,18,16,19],[15,20,17,21],[21,20,21,21],[22,1,22,3],[22,20,22,21],[18,20,18,21],[19,20,19,21],[20,1,20,3],[18,1,18,3],[19,1,19,3],[23,1,23,3],[23,20,23,21],[24,1,24,3],[24,20,24,21],[25,1,25,3],[21,1,21,3],[75,9,75,12],[5,11,7,17],[5,3,5,6],[1,1,1,21],[5,1,5,2],[47,15,47,16],[51,8,51,12],[46,8,46,12],[16,6,16,7],[16,8,16,9],[16,10,16,11],[11,2,11,10],[12,11,13,17],[17,1,17,3],[16,14,16,15],[11,11,11,17],[43,8,43,12],[42,8,42,12],[42,1,42,3],[41,8,41,12],[15,1,16,5],[16,12,16,13],[15,6,15,15],[54,8,54,12]]}
[]
[null,"ENTRADA DE DADOS POR SUBSISTEMA"]
[]
[]
[]
[null,"Subsistema n° 1:",null,"Bovino",null,null,null,null,null,null,"OBS","rever o valor do esterco bovino"]
[]
[null,"ÁREA",4.54,"hectare(s)"]
[]
[]
[]
[null,null,"Horas Trabalhadas",null,null,null,null,null,null,null,null,"Observações"]
[null,null,"Mulher","Homem","Jovens Mulheres","Jovens Homens","Outras","Outros","Total Mulheres","Total Homens","TOTAL"]
[null,"N° Horas",{"$f":"0.5*365","v":182.5},{"$f":"7*365","v":2555},{"$f":"(0.15*365)+(24*12)","v":342.75},{"$f":"24*12","v":288},null,null,{"$f":"C14+E14+G14","v":525.25},{"$f":"D14+F14+H14","v":2843},{"$f":"C14+D14+E14+F14+G14+H14","v":3368.25}]
[]
[null,"Produtos e Insumos Gerados",null,null,null,null,"Produtos",null,null,null,null,null,null,null,null,null,"Insumos Produzidos",null,"Total Produtos e Insumos",null,"Observações"]
[null,null,null,null,null,null,"Venda",null,"Autoconsumo",null,"Doações Trocas",null,"Estoque",null,"Total Produtos"]
[null,"Itens",null,null,"Unidade","Valor Unitário","Qtde","Valor Total","Qtde","Valor Total","Qtde","Valor Total","Qtde","Valor Total","Qtde","Valor Total","Qtde","Valor Total","Qtde","Valor Total"]
[null,"Leite",null,null,"Litro",1.1000000000000001,{"$f":"((30*210) + (20*60)+ (6*30))-(16*12)","v":7488},{"$f":"G19*F19","v":8236.8000000000011},192,{"$f":"I19*F19","v":211.20000000000002},200,{"$f":"K19*F19","v":220.00000000000003},null,{"$f":"M19*F19","v":0},{"$f":"G19++I19+K19+M19","v":7880},{"$f":"F19*O19","v":8668},null,{"$f":"Q19*F19","v":0},{"$f":"O19+Q19","v":7880},{"$f":"F19*S19","v":8668}]
[null,"vaca (4)",null,null,"kg",{"$f":"2000/195","v":10.256410256410257},195,2000.0000000000002,null,0,null,0,750,7692.3076923076933,945,9692.3076923076933,null,0,945,9692.3076923076933]
[null,"esterco",null,null,"kg",2,null,0,null,0,null,0,null,0,0,0,1680,3360,1680,3360]
[null,null,null,null,null,null,null,0,null,0,null,0,null,0,0,0,null,0,0,0]
[null,null,null,null,null,null,null,0,null,0,null,0,null,0,0,0,null,0,0,0]
[null,null,null,null,null,null,null,0,null,0,null,0,null,0,0,0,null,0,0,0]
[null,null,null,null,null,null,null,0,null,0,null,0,null,0,0,0,null,0,0,0]
[null,null,null,null,null,null,null,0,null,0,null,0,null,0,0,0,null,0,0,0]
[null,null,null,null,null,null,null,0,null,0,null,0,null,0,0,0,null,0,0,0]
[null,null,null,null,null,null,null,0,null,0,null,0,null,0,0,0,null,0,0,0]
[null,null,null,null,null,null,null,0,null,0,null,0,null,0,0,0,null,0,0,0]
[null,null,null,null,null,null,null,0,null,0,null,0,null,0,0,0,null,0,0,0]
[null,null,null,null,null,null,null,0,null,0,null,0,null,0,0,0,null,0,0,0]
[null,null,null,null,null,null,null,0,null,0,null,0,null,0,0,0,null,0,0,0]
[null,null,null,null,null,null,null,0,null,0,null,0,null,0,0,0,null,0,0,0]
[null,null,null,null,null,null,null,0,null,0,null,0,null,0,0,0,null,0,0,0]
[null,null,null,null,null,null,null,0,null,0,null,0,null,0,0,0,null,0,0,0]
[null,null,null,null,null,null,null,0,null,0,null,0,null,0,0,0,null,0,0,0]
[null,"Totais",null,null,null,null,null,{"$f":"SUM(H19:H36)","v":10236.800000000001},null,{"$f":"SUM(J19:J36)","v":211.20000000000002},null,{"$f":"SUM(L19:L36)","v":220.00000000000003},null,{"$f":"SUM(N19:N36)","v":7692.3076923076933},null,{"$f":"SUM(P19:P36)","v":18360.307692307695},null,{"$f":"SUM(R19:R36)","v":3360},null,{"$f":"SUM(T19:T36)","v":21720.307692307695}]
[]
[null,"Insumos"]
[null,"Produção Própria - Reciprocidade Ecológica",null,null,null,null,null,null,"Observações"]
[null,"Itens",null,null,"Unidade","Valor Unitário","Qtde","Valor Total"]
[null,"silagem",null,null,"ton",300,10,{"$f":"G42*F42","v":3000}]
[null,"palha",null,null,"kg",0.4,{"$f":"(120*15)","v":1800},{"$f":"G43*F43","v":720},"120 kg/dia de alimentação"]
[null,"palma",null,null,"kg",0.2,{"$f":"(60*335)","v":20100},4020,"Ajustado de 1,00 para 0,20/kg"]
[null,null,null,null,null,null,null,{"$f":"G45*F45","v":0}]
[null,null,null,null,null,null,null,0]
[null,null,null,null,null,null,null,0]
[null,null,null,null,null,null,null,0]
[null,null,null,null,null,null,null,0]
[null,null,null,null,null,null,null,0]
[null,null,null,null,null,null,null,0]
[null,null,null,null,null,null,null,0]
[null,null,null,null,null,null,null,0]
[null,null,null,null,null,null,null,0]
[null,null,null,null,null,null,null,0]
[null,null,null,null,null,null,null,0]
[null,"Total Insumos -  Produção Própria",null,null,null,null,null,{"$f":"SUM(H42:H56)","v":7740}]
[null,"Comprados - Consumos Intermediários ",null,null,null,null,null,null,null,"Observações"]
[null,"Itens",null,null,"Unidade","Valor Unitário","Qtde","Valor Total","Origem"]
[null,"sais",null,null,"kg",1,45,{"$f":"G60*F60","v":45},"F"]
[null,"silo",null,null,"ton",300,6,{"$f":"G61*F61","v":1800},"T"]
[null,"vacina",null,null,"Unidade",1.5,10,15,"F"]
[null,"Remédio",null,null,"unidade",300,1,300,"F"]
[null,null,null,null,null,null,null,0]
[null,null,null,null,null,null,null,0]
[null,null,null,null,null,null,null,0]
[null,null,null,null,null,null,null,0]
[null,null,null,null,null,null,null,0]
[null,null,null,null,null,null,null,0]
[null,null,null,null,null,null,null,0]
[null,null,null,null,null,null,null,0]
[null,null,null,null,null,null,null,0]
[null,null,null,null,null,null,null,0]
[null,null,null,null,null,null,null,0]
[null,null,null,null,null,null,null,0]
[null,null,null,null,null,null,null,0]
[null,null,null,null,null,null,null,0]
[null,null,null,null,null,null,null,0]
[null,null,null,null,null,null,null,0]
[null," Insumos Comprados no Território",null,null,null,null,null,{"$f":"DSUM(H59:I79,\"Valor Total\",G124:G125)","v":1800}]
[null," Insumos Comprados Fora do Território",null,null,null,null,null,{"$f":"DSUM(H59:I79,\"Valor Total\",H124:H125)","v":360}]
[null,"Total de Insumos Comprados",null,null,null,null,null,{"$f":"SUM(H60:H79)","v":2160}]
[]
[null,"Pagamento a Terceiros",null,null,null,null,null,null,null,"Observações"]
[null,"Serviços/Renda da Terra",null,null,"Unidade","Valor Unitário","Qtde","Valor Total","Origem"]
[null,null,null,null,null,null,null,{"$f":"G86*F86","v":0}]
[null,null,null,null,null,null,null,0]
[null,null,null,null,null,null,null,0]
[null,null,null,null,null,null,null,0]
[null,null,null,null,null,null,null,0]
[null,null,null,null,null,null,null,0]
[null,null,null,null,null,null,null,0]
[null,null,null,null,null,null,null,0]
[null,null,null,null,null,null,null,0]
[null,null,null,null,null,null,null,0]
[null,null,null,null,null,null,null,0]
[null,null,null,null,null,null,null,0]
[null,null,null,null,null,null,null,0]
[null,null,null,null,null,null,null,0]
[null,null,null,null,null,null,null,0]
[null,"Pagamentos a Terceiros do Território",null,null,null,null,null,{"$f":"DSUM(H85:I100,\"Valor Total\",G124:G125)","v":0}]
[null,"Pagamentos a Terceiros Fora do Território",null,null,null,null,null,{"$f":"DSUM(H85:I100,\"Valor Total\",H124:H125)","v":0}]
[null,"Total de Pagamentos a Terceiros ",null,null,null,null,null,{"$f":"SUM(H86:H100)","v":0}]
[]
[null,"Entrada de Recursos  por Reciprocidade",null,null,null,null,null,null,"Observações"]
[null,"Serviços e Insumos",null,null,"Unidade","Valor Unitário","Qtde","Valor Total"]
[null,null,null,null,null,null,null,{"$f":"G107*F107","v":0}]
[null,null,null,null,null,null,null,0]
[null,null,null,null,null,null,null,0]
[null,null,null,null,null,null,null,0]
[null,null,null,null,null,null,null,0]
[null,null,null,null,null,null,null,0]
[null,null,null,null,null,null,null,0]
[null,null,null,null,null,null,null,0]
[null,null,null,null,null,null,null,0]
[null,null,null,null,null,null,null,0]
[null,null,null,null,null,null,null,0]
[null,null,null,null,null,null,null,0]
[null,null,null,null,null,null,null,0]
[null,null,null,null,null,null,null,0]
[null,null,null,null,null,null,null,0]
[null,"Total Recursos por Reciprocidade",null,null,null,null,null,{"$f":"SUM(H107:H121)","v":0}]
[]
[null,null,null,null,null,null,"Origem","Origem"]
[null,null,null,null,null,null,"T","F"]

{"sheet":"SUB. 2","index":12,"n_rows":125,"n_cols":21,"rows_kept":125,"cut":false,"hidden":false,"merged":[[5,11,7,17],[15,18,16,19],[39,1,39,7],[57,1,57,8],[83,1,83,8],[104,1,104,7],[79,4,79,6],[80,4,80,6],[81,4,81,6],[100,4,100,6],[101,4,101,6],[99,1,99,3],[99,9,99,12],[100,9,102,12],[104,8,105,12],[105,1,105,3],[100,1,100,3],[101,1,101,3],[95,1,95,3],[95,9,95,12],[96,1,96,3],[96,9,96,12],[97,1,97,3],[98,1,98,3],[115,1,115,3],[121,1,121,3],[121,8,121,12],[118,1,118,3],[118,8,118,12],[119,1,119,3],[119,8,119,12],[120,1,120,3],[120,8,120,12],[115,8,115,12],[116,1,116,3],[116,8,116,12],[117,1,117,3],[117,8,117,12],[114,1,114,3],[114,8,114,12],[106,1,106,3],[106,8,106,12],[107,1,107,3],[107,8,107,12],[108,1,108,3],[108,8,108,12],[109,1,109,3],[109,8,109,12],[110,1,110,3],[110,8,110,12],[111,1,111,3],[111,8,111,12],[102,1,102,3],[93,1,93,3],[93,9,93,12],[94,1,94,3],[94,9,94,12],[102,4,102,6],[112,1,112,3],[112,8,112,12],[113,1,113,3],[113,8,113,12],[97,9,97,12],[88,1,88,3],[88,9,88,12],[89,1,89,3],[89,9,89,12],[90,1,90,3],[98,9,98,12],[90,9,90,12],[91,1,91,3],[91,9,91,12],[92,1,92,3],[92,9,92,12],[83,9,84,12],[84,1,84,3],[85,1,85,3],[77,1,77,3],[85,9,85,12],[79,1,79,3],[79,9,81,12],[80,1,80,3],[81,1,81,3],[77,9,77,12],[78,1,78,3],[86,1,86,3],[86,9,86,12],[87,1,87,3],[87,9,87,12],[67,1,67,3],[67,9,67,12],[68,1,68,3],[68,9,68,12],[78,9,78,12],[69,1,69,3],[69,9,69,12],[70,1,70,3],[70,9,70,12],[71,1,71,3],[71,9,71,12],[72,1,72,3],[72,9,72,12],[73,1,73,3],[73,9,73,12],[74,1,74,3],[74,9,74,12],[75,1,75,3],[75,9,75,12],[76,1,76,3],[76,9,76,12],[62,1,62,3],[63,1,63,3],[63,9,63,12],[62,9,62,12],[64,1,64,3],[64,9,64,12],[65,1,65,3],[65,9,65,12],[66,1,66,3],[66,9,66,12],[59,1,59,3],[59,9,59,12],[60,1,60,3],[60,9,60,12],[61,1,61,3],[61,9,61,12],[43,1,43,3],[46,1,46,3],[47,1,47,3],[48,1,48,3],[54,1,54,3],[55,1,55,3],[57,9,58,12],[58,1,58,3],[53,8,53,12],[53,1,53,3],[56,1,56,3],[49,1,49,3],[52,8,52,12],[51,1,51,3],[46,8,46,12],[47,8,47,12],[52,1,52,3],[50,1,50,3],[34,20,34,21],[35,20,35,21],[36,20,36,21],[38,1,38,12],[44,1,44,3],[45,1,45,3],[40,1,40,3],[34,1,34,3],[35,1,35,3],[36,1,36,3],[41,1,41,3],[39,8,40,12],[41,8,41,12],[42,1,42,3],[42,8,42,12],[43,8,43,12],[44,8,44,12],[45,8,45,12],[22,20,22,21],[26,20,26,21],[27,20,27,21],[28,20,28,21],[28,1,28,3],[27,1,27,3],[29,1,29,3],[29,20,29,21],[30,1,30,3],[30,20,30,21],[33,1,33,3],[33,20,33,21],[23,1,23,3],[23,20,23,21],[24,1,24,3],[24,20,24,21],[25,1,25,3],[25,20,25,21],[26,1,26,3],[31,1,31,3],[31,20,31,21],[32,1,32,3],[32,20,32,21],[18,1,18,3],[12,11,13,17],[18,20,18,21],[19,1,19,3],[19,20,19,21],[20,1,20,3],[20,20,20,21],[15,20,17,21],[15,16,16,17],[17,1,17,3],[16,14,16,15],[47,15,47,16],[48,15,48,16],[49,15,49,16],[5,1,5,2],[5,3,5,6],[1,1,1,21],[54,8,54,12],[55,8,55,12],[56,8,56,12],[48,8,48,12],[49,8,49,12],[50,8,50,12],[51,8,51,12],[11,2,11,10],[16,10,16,11],[16,12,16,13],[11,11,11,17],[21,20,21,21],[15,6,15,15],[22,1,22,3],[15,1,16,5],[21,1,21,3],[16,6,16,7],[16,8,16,9]]}
[]
[null,"ENTRADA DE DADOS POR SUBSISTEMA"]
[]
[]
[]
[null,"Subsistema n° 2:",null,"Suino",null,null,null,null,null,null,"OBS"]
[]
[null,"ÁREA",0.01,"hectare(s)"]
[]
[]
[]
[null,null,"Horas Trabalhadas",null,null,null,null,null,null,null,null,"Observações"]
[null,null,"Mulher","Homem","Jovens Mulheres","Jovens Homens","Outras","Outros","Total Mulheres","Total Homens","TOTAL"]
[null,"N° Horas",{"$f":"0.5*360","v":180},{"$f":"0.5*360","v":180},{"$f":"0.25*365","v":91.25},null,null,null,{"$f":"C14+E14+G14","v":271.25},{"$f":"D14+F14+H14","v":180},{"$f":"C14+D14+E14+F14+G14+H14","v":451.25}]
[]
[null,"Produtos e Insumos Gerados",null,null,null,null,"Produtos",null,null,null,null,null,null,null,null,null,"Insumos Produzidos",null,"Total Produtos e Insumos",null,"Observações"]
[null,null,null,null,null,null,"Venda",null,"Autoconsumo",null,"Doações Trocas",null,"Estoque",null,"Total Produtos"]
[null,"Itens",null,null,"Unidade","Valor Unitário","Qtde","Valor Total","Qtde","Valor Total","Qtde","Valor Total","Qtde","Valor Total","Qtde","Valor Total","Qtde","Valor Total","Qtde","Valor Total"]
[null,"porco",null,null,"kg",15,{"$f":"(12*6)+(3*150)","v":522},{"$f":"G19*F19","v":7830},60,{"$f":"I19*F19","v":900},100,{"$f":"K19*F19","v":1500},440,{"$f":"M19*F19","v":6600},{"$f":"G19+I19+K19+M19","v":1122},{"$f":"F19*O19","v":16830},null,{"$f":"Q19*F19","v":0},{"$f":"O19+Q19","v":1122},{"$f":"F19*S19","v":16830}," tem um reprodutor vale o dobro"]
[null,"esterco",null,null,"kg",0.42,null,0,null,0,null,0,null,0,0,0,365,153.29999999999998,365,153.29999999999998]
[null,null,null,null,null,null,null,{"$f":"G21*F21","v":0},null,{"$f":"I21*F21","v":0},null,{"$f":"K21*F21","v":0},null,{"$f":"M21*F21","v":0},{"$f":"G21+I21+K21+M21","v":0},{"$f":"F21*O21","v":0},null,{"$f":"Q21*F21","v":0},{"$f":"O21+Q21","v":0},{"$f":"F21*S21","v":0}]
[null,null,null,null,null,null,null,0,null,0,null,0,null,0,0,0,null,0,0,0]
[null,null,null,null,null,null,null,0,null,0,null,0,null,0,0,0,null,0,0,0]
[null,null,null,null,null,null,null,0,null,0,null,0,null,0,0,0,null,0,0,0]
[null,null,null,null,null,null,null,0,null,0,null,0,null,0,0,0,null,0,0,0]
[null,null,null,null,null,null,null,0,null,0,null,0,null,0,0,0,null,0,0,0]
[null,null,null,null,null,null,null,0,null,0,null,0,null,0,0,0,null,0,0,0]
[null,null,null,null,null,null,null,0,null,0,null,0,null,0,0,0,null,0,0,0]
[null,null,null,null,null,null,null,0,null,0,null,0,null,0,0,0,null,0,0,0]
[null,null,null,null,null,null,null,0,null,0,null,0,null,0,0,0,null,0,0,0]
[null,null,null,null,null,null,null,0,null,0,null,0,null,0,0,0,null,0,0,0]
[null,null,null,null,null,null,null,0,null,0,null,0,null,0,0,0,null,0,0,0]
[null,null,null,null,null,null,null,0,null,0,null,0,null,0,0,0,null,0,0,0]
[null,null,null,null,null,null,null,0,null,0,null,0,null,0,0,0,null,0,0,0]
[null,null,null,null,null,null,null,0,null,0,null,0,null,0,0,0,null,0,0,0]
[null,null,null,null,null,null,null,0,null,0,null,0,null,0,0,0,null,0,0,0]
[null,"Totais",null,null,null,null,null,{"$f":"SUM(H19:H36)","v":7830},null,{"$f":"SUM(J19:J36)","v":900},null,{"$f":"SUM(L19:L36)","v":1500},null,{"$f":"SUM(N19:N36)","v":6600},null,{"$f":"SUM(P19:P36)","v":16830},null,{"$f":"SUM(R19:R36)","v":153.29999999999998},null,{"$f":"SUM(T19:T36)","v":16983.3}]
[]
[null,"Insumos"]
[null,"Produção Própria - Reciprocidade Ecológica",null,null,null,null,null,null,"Observações"]
[null,"Itens",null,null,"Unidade","Valor Unitário","Qtde","Valor Total"]
[null,null,null,null,null,null,null,{"$f":"G42*F42","v":0}]
[null,null,null,null,null,null,null,0]
[null,null,null,null,null,null,null,0]
[null,null,null,null,null,null,null,0]
[null,null,null,null,null,null,null,0]
[null,null,null,null,null,null,null,0]
[null,null,null,null,null,null,null,0]
[null,null,null,null,null,null,null,0]
[null,null,null,null,null,null,null,0]
[null,null,null,null,null,null,null,0]
[null,null,null,null,null,null,null,0]
[null,null,null,null,null,null,null,0]
[null,null,null,null,null,null,null,0]
[null,null,null,null,null,null,null,0]
[null,null,null,null,null,null,null,0]
[null,"Total Insumos -  Produção Própria",null,null,null,null,null,{"$f":"SUM(H42:H56)","v":0}]
[null,"Comprados - Consumos Intermediários ",null,null,null,null,null,null,null,"Observações"]
[null,"Insumos",null,null,"Unidade","Valor Unitário","Qtde","Valor Total","Origem"]
[null,"milho grão",null,null,"kg",{"$f":"50/60","v":0.83333333333333337},720,{"$f":"G60*F60","v":600},"F"]
[null,"farelo de trigo",null,null,"kg",{"$f":"30/30","v":1},360,{"$f":"G61*F61","v":360},"F"]
[null,"ração leiteira",null,null,"kg",{"$f":"80/60","v":1.3333333333333333},120,160,"T"]
[null,null,null,null,null,null,null,{"$f":"G63*F63","v":0}]
[null,null,null,null,null,null,null,0]
[null,null,null,null,null,null,null,0]
[null,null,null,null,null,null,null,0]
[null,null,null,null,null,null,null,0]
[null,null,null,null,null,null,null,0]
[null,null,null,null,null,null,null,0]
[null,null,null,null,null,null,null,0]
[null,null,null,null,null,null,null,0]
[null,null,null,null,null,null,null,0]
[null,null,null,null,null,null,null,0]
[null,null,null,null,null,null,null,0]
[null,null,null,null,null,null,null,0]
[null,null,null,null,null,null,null,0]
[null,null,null,null,null,null,null,0]
[null,null,null,null,null,null,null,0]
[null,null,null,null,null,null,null,0]
[null," Insumos Comprados no Território",null,null,null,null,null,{"$f":"DSUM(H59:I79,\"Valor Total\",G124:G125)","v":160}]
[null," Insumos Comprados Fora do Território",null,null,null,null,null,{"$f":"DSUM(H59:I79,\"Valor Total\",H124:H125)","v":960}]
[null,"Total de Insumos Comprados",null,null,null,null,null,{"$f":"SUM(H60:H79)","v":1120}]
[]
[null,"Pagamento a Terceiros",null,null,null,null,null,null,null,"Observações"]
[null,"Serviços/Renda da Terra",null,null,"Unidade","Valor Unitário","Qtde","Valor Total","Origem"]
[null,null,null,null,null,null,null,{"$f":"G86*F86","v":0}]
[null,null,null,null,null,null,null,0]
[null,null,null,null,null,null,null,0]
[null,null,null,null,null,null,null,0]
[null,null,null,null,null,null,null,0]
[null,null,null,null,null,null,null,0]
[null,null,null,null,null,null,null,0]
[null,null,null,null,null,null,null,0]
[null,null,null,null,null,null,null,0]
[null,null,null,null,null,null,null,0]
[null,null,null,null,null,null,null,0]
[null,null,null,null,null,null,null,0]
[null,null,null,null,null,null,null,0]
[null,null,null,null,null,null,null,0]
[null,null,null,null,null,null,null,0]
[null,"Pagamentos a Terceiros do Território",null,null,null,null,null,{"$f":"DSUM(H85:I100,\"Valor Total\",G124:G125)","v":0}]
[null,"Pagamentos a Terceiros Fora do Território",null,null,null,null,null,{"$f":"DSUM(H85:I100,\"Valor Total\",H124:H125)","v":0}]
[null,"Total de Pagamentos a Terceiros ",null,null,null,null,null,{"$f":"SUM(H86:H100)","v":0}]
[]
[null,"Entrada de Recursos  por Reciprocidade",null,null,null,null,null,null,"Observações"]
[null,"Serviços e Insumos",null,null,"Unidade","Valor Unitário","Qtde","Valor Total"]
[null,"Soro da comunidade",null,null,"Litros",0.1,{"$f":"50*365","v":18250},{"$f":"G107*F107","v":1825}]
[null,null,null,null,null,null,null,0]
[null,null,null,null,null,null,null,0]
[null,null,null,null,null,null,null,0]
[null,null,null,null,null,null,null,0]
[null,null,null,null,null,null,null,0]
[null,null,null,null,null,null,null,0]
[null,null,null,null,null,null,null,0]
[null,null,null,null,null,null,null,0]
[null,null,null,null,null,null,null,0]
[null,null,null,null,null,null,null,0]
[null,null,null,null,null,null,null,0]
[null,null,null,null,null,null,null,0]
[null,null,null,null,null,null,null,0]
[null,null,null,null,null,null,null,0]
[null,"Total Recursos por Reciprocidade",null,null,null,null,null,{"$f":"SUM(H107:H121)","v":1825}]
[]
[null,null,null,null,null,null,"Origem","Origem"]
[null,null,null,null,null,null,"T","F"]

{"sheet":"SUB. 3","index":13,"n_rows":125,"n_cols":21,"rows_kept":125,"cut":false,"hidden":false,"merged":[[121,1,121,3],[5,11,7,17],[57,1,57,8],[83,1,83,8],[104,1,104,7],[79,4,79,6],[80,4,80,6],[81,4,81,6],[100,4,100,6],[101,4,101,6],[102,4,102,6],[100,1,100,3],[101,1,101,3],[102,1,102,3],[121,8,121,12],[118,1,118,3],[118,8,118,12],[119,1,119,3],[119,8,119,12],[120,1,120,3],[112,1,112,3],[112,8,112,12],[113,1,113,3],[113,8,113,12],[114,1,114,3],[114,8,114,12],[120,8,120,12],[115,1,115,3],[115,8,115,12],[116,1,116,3],[116,8,116,12],[117,1,117,3],[117,8,117,12],[107,1,107,3],[107,8,107,12],[108,1,108,3],[108,8,108,12],[109,1,109,3],[109,8,109,12],[110,1,110,3],[110,8,110,12],[111,1,111,3],[111,8,111,12],[98,1,98,3],[98,9,98,12],[99,1,99,3],[99,9,99,12],[100,9,102,12],[104,8,105,12],[105,1,105,3],[106,1,106,3],[106,8,106,12],[93,1,93,3],[93,9,93,12],[94,1,94,3],[94,9,94,12],[95,1,95,3],[95,9,95,12],[96,1,96,3],[96,9,96,12],[97,1,97,3],[97,9,97,12],[88,1,88,3],[88,9,88,12],[89,1,89,3],[89,9,89,12],[90,1,90,3],[90,9,90,12],[91,1,91,3],[91,9,91,12],[92,1,92,3],[92,9,92,12],[83,9,84,12],[84,1,84,3],[85,1,85,3],[85,9,85,12],[86,1,86,3],[86,9,86,12],[87,1,87,3],[44,1,44,3],[46,1,46,3],[47,1,47,3],[48,1,48,3],[45,1,45,3],[87,9,87,12],[51,1,51,3],[52,1,52,3],[53,1,53,3],[54,1,54,3],[55,1,55,3],[49,1,49,3],[78,1,78,3],[78,9,78,12],[70,9,70,12],[72,1,72,3],[50,1,50,3],[77,1,77,3],[77,9,77,12],[69,1,69,3],[69,9,69,12],[70,1,70,3],[79,1,79,3],[79,9,81,12],[80,1,80,3],[81,1,81,3],[71,1,71,3],[71,9,71,12],[74,1,74,3],[74,9,74,12],[75,1,75,3],[75,9,75,12],[76,1,76,3],[76,9,76,12],[72,9,72,12],[73,1,73,3],[73,9,73,12],[65,9,65,12],[66,1,66,3],[66,9,66,12],[67,1,67,3],[67,9,67,12],[68,1,68,3],[68,9,68,12],[59,1,59,3],[59,9,59,12],[60,1,60,3],[60,9,60,12],[61,1,61,3],[61,9,61,12],[62,1,62,3],[62,9,62,12],[63,1,63,3],[63,9,63,12],[64,1,64,3],[64,9,64,12],[65,1,65,3],[34,20,34,21],[35,1,35,3],[35,20,35,21],[36,1,36,3],[36,20,36,21],[57,9,58,12],[58,1,58,3],[29,1,29,3],[29,20,29,21],[30,1,30,3],[30,20,30,21],[31,1,31,3],[31,20,31,21],[32,1,32,3],[32,20,32,21],[33,1,33,3],[33,20,33,21],[43,8,43,12],[47,8,47,12],[48,8,48,12],[49,8,49,12],[56,8,56,12],[50,8,50,12],[56,1,56,3],[1,1,1,21],[5,1,5,2],[5,3,5,8],[11,2,11,10],[17,1,17,3],[15,1,16,5],[15,16,16,17],[12,11,13,17],[11,11,11,17],[15,18,16,19],[15,6,15,15],[15,20,17,21],[16,12,16,13],[16,14,16,15],[16,6,16,7],[16,8,16,9],[27,20,27,21],[28,20,28,21],[18,1,18,3],[18,20,18,21],[19,1,19,3],[19,20,19,21],[21,1,21,3],[22,1,22,3],[22,20,22,21],[20,1,20,3],[20,20,20,21],[21,20,21,21],[23,1,23,3],[23,20,23,21],[24,1,24,3],[24,20,24,21],[25,1,25,3],[25,20,25,21],[26,1,26,3],[26,20,26,21],[47,15,47,16],[48,15,48,16],[49,15,49,16],[51,8,51,12],[52,8,52,12],[53,8,53,12],[54,8,54,12],[55,8,55,12],[16,10,16,11],[38,1,38,12],[39,8,40,12],[41,8,41,12],[42,8,42,12],[39,1,39,7],[44,8,44,12],[45,8,45,12],[46,8,46,12],[40,1,40,3],[41,1,41,3],[42,1,42,3],[43,1,43,3],[27,1,27,3],[28,1,28,3],[34,1,34,3]]}
[]
[null,"ENTRADA DE DADOS POR SUBSISTEMA"]
[]
[]
[]
[null,"Subsistema n° 3:",null,"Ovino",null,null,null,null,null,null,"OBS"]
[]
[null,"ÁREA",4.54,"hectare(s)"]
[]
[]
[]
[null,null,"Horas Trabalhadas",null,null,null,null,null,null,null,null,"Observações"]
[null,null,"Mulher","Homem","Jovens Mulheres","Jovens Homens","Outras","Outros","Total Mulheres","Total Homens","TOTAL","60 minutos de trabalho entre as mulheres"]
[null,"N° Horas",{"$f":"0.5*365","v":182.5},{"$f":"0.5*365","v":182.5},{"$f":"0.25*365","v":91.25},null,null,null,{"$f":"C14+E14+G14","v":273.75},{"$f":"D14+F14+H14","v":182.5},{"$f":"C14+D14+E14+F14+G14+H14","v":456.25}]
[]
[null,"Produtos e Insumos Gerados",null,null,null,null,"Produtos",null,null,null,null,null,null,null,null,null,"Insumos Produzidos",null,"Total Produtos e Insumos",null,"Observações"]
[null,null,null,null,null,null,"Venda",null,"Autoconsumo",null,"Doações Trocas",null,"Estoque",null,"Total Produtos"]
[null,"Itens",null,null,"Unidade","Valor Unitário","Qtde","Valor Total","Qtde","Valor Total","Qtde","Valor Total","Qtde","Valor Total","Qtde","Valor Total","Qtde","Valor Total","Qtde","Valor Total"]
[null,"animal",null,null,"kg",9,20,{"$f":"G19*F19","v":180},null,{"$f":"I19*F19","v":0},0,{"$f":"K19*F19","v":0},25,{"$f":"M19*F19","v":225},{"$f":"G19+I19+K19+M19","v":45},{"$f":"F19*O19","v":405},null,{"$f":"Q19*F19","v":0},{"$f":"O19+Q19","v":45},{"$f":"F19*S19","v":405}]
[null,"esterco ",null,null,"kg",0.42,0,0,null,0,0,0,0,0,0,0,1500,630,1500,630]
[null,null,null,null,null,null,null,0,null,0,0,0,0,0,0,0,null,0,0,0]
[null,null,null,null,null,null,null,0,null,0,0,0,0,0,0,0,null,0,0,0]
[null,null,null,null,null,null,null,0,null,0,0,0,0,0,0,0,null,0,0,0]
[null,null,null,null,null,null,0,0,null,0,0,0,0,0,0,0,null,0,0,0]
[null,null,null,null,null,null,0,0,null,0,0,0,0,0,0,0,null,0,0,0]
[null,null,null,null,null,null,0,0,null,0,0,0,0,0,0,0,null,0,0,0]
[null,null,null,null,null,null,0,0,null,0,0,0,0,0,0,0,null,0,0,0]
[null,null,null,null,null,null,0,0,null,0,0,0,0,0,0,0,null,0,0,0]
[null,null,null,null,null,null,0,0,null,0,0,0,0,0,0,0,null,0,0,0]
[null,null,null,null,null,null,0,0,null,0,0,0,0,0,0,0,null,0,0,0]
[null,null,null,null,null,null,0,0,null,0,0,0,0,0,0,0,null,0,0,0]
[null,null,null,null,null,null,0,0,0,0,0,0,null,0,0,0,null,0,0,0]
[null,null,null,null,null,null,0,0,0,0,0,0,null,0,0,0,null,0,0,0]
[null,null,null,null,null,null,0,0,0,0,0,0,null,0,0,0,null,0,0,0]
[null,null,null,null,null,null,0,0,0,0,0,0,null,0,0,0,null,0,0,0]
[null,null,null,null,null,null,null,0,null,0,null,0,null,0,0,0,null,0,0,0]
[null,"Totais",null,null,null,null,null,{"$f":"SUM(H19:H36)","v":180},null,{"$f":"SUM(J19:J36)","v":0},null,{"$f":"SUM(L19:L36)","v":0},null,{"$f":"SUM(N19:N36)","v":225},null,{"$f":"SUM(P19:P36)","v":405},null,{"$f":"SUM(R19:R36)","v":630},null,{"$f":"SUM(T19:T36)","v":1035}]
[]
[null,"Insumos"]
[null,"Produção Própria - Reciprocidade Ecológica",null,null,null,null,null,null,"Observações"]
[null,"Itens",null,null,"Unidade","Valor Unitário","Qtde","Valor Total"]
[null,"palha de milho",null,null,"kg",0.4,{"$f":"3*15","v":45},{"$f":"G42*F42","v":18}]
[null,"palma",null,null,"kg",1,{"$f":"(5*365)","v":1825},1825]
[null,"ração milho",null,null,"kg",1,300,300]
[null,"silo",null,null,"kg",0.3,365,109.5]
[null,null,null,null,null,null,null,0]
[null,null,null,null,null,null,null,0]
[null,null,null,null,null,null,null,0]
[null,null,null,null,null,null,null,0]
[null,null,null,null,null,null,null,0]
[null,null,null,null,null,null,null,0]
[null,null,null,null,null,null,null,0]
[null,null,null,null,null,null,null,0]
[null,null,null,null,null,null,null,0]
[null,null,null,null,null,null,null,0]
[null,null,null,null,null,null,null,0]
[null,"Total Insumos -  Produção Própria",null,null,null,null,null,{"$f":"SUM(H42:H56)","v":2252.5}]
[null,"Comprados - Consumos Intermediários ",null,null,null,null,null,null,null,"Observações"]
[null,"Insumos",null,null,"Unidade","Valor Unitário","Qtde","Valor Total","Origem"]
[null,null,null,null,null,null,null,{"$f":"G60*F60","v":0}]
[null,null,null,null,null,null,null,0]
[null,null,null,null,null,null,null,0]
[null,null,null,null,null,null,null,{"$f":"G63*F63","v":0}]
[null,null,null,null,null,null,null,0]
[null,null,null,null,null,null,null,0]
[null,null,null,null,null,null,null,0]
[null,null,null,null,null,null,null,0]
[null,null,null,null,null,null,null,0]
[null,null,null,null,null,null,null,0]
[null,null,null,null,null,null,null,0]
[null,null,null,null,null,null,null,0]
[null,null,null,null,null,null,null,0]
[null,null,null,null,null,null,null,0]
[null,null,null,null,null,null,null,0]
[null,null,null,null,null,null,null,0]
[null,null,null,null,null,null,null,0]
[null,null,null,null,null,null,null,0]
[null,null,null,null,null,null,null,0]
[null,null,null,null,null,null,null,0]
[null," Insumos Comprados no Território",null,null,null,null,null,{"$f":"DSUM(H59:I79,\"Valor Total\",G124:G125)","v":0}]
[null," Insumos Comprados Fora do Território",null,null,null,null,null,{"$f":"DSUM(H59:I79,\"Valor Total\",H124:H125)","v":0}]
[null,"Total de Insumos Comprados",null,null,null,null,null,{"$f":"SUM(H60:H79)","v":0}]
[]
[null,"Pagamento a Terceiros",null,null,null,null,null,null,null,"Observações"]
[null,"Serviços/Renda da Terra",null,null,"Unidade","Valor Unitário","Qtde","Valor Total","Origem"]
[null,null,null,null,null,null,null,{"$f":"G86*F86","v":0}]
[null,null,null,null,null,null,null,0]
[null,null,null,null,null,null,null,0]
[null,null,null,null,null,null,null,0]
[null,null,null,null,null,null,null,0]
[null,null,null,null,null,null,null,0]
[null,null,null,null,null,null,null,0]
[null,null,null,null,null,null,null,0]
[null,null,null,null,null,null,null,0]
[null,null,null,null,null,null,null,0]
[null,null,null,null,null,null,null,0]
[null,null,null,null,null,null,null,0]
[null,null,null,null,null,null,null,0]
[null,null,null,null,null,null,null,0]
[null,null,null,null,null,null,null,0]
[null,"Pagamentos a Terceiros do Território",null,null,null,null,null,{"$f":"DSUM(H85:I100,\"Valor Total\",G124:G125)","v":0}]
[null,"Pagamentos a Terceiros Fora do Território",null,null,null,null,null,{"$f":"DSUM(H85:I100,\"Valor Total\",H124:H125)","v":0}]
[null,"Total de Pagamentos a Terceiros ",null,null,null,null,null,{"$f":"SUM(H86:H100)","v":0}]
[]
[null,"Entrada de Recursos  por Reciprocidade",null,null,null,null,null,null,"Observações"]
[null,"Serviços e Insumos",null,null,"Unidade","Valor Unitário","Qtde","Valor Total"]
[null,null,null,null,null,null,null,{"$f":"G107*F107","v":0}]
[null,null,null,null,null,null,null,0]
[null,null,null,null,null,null,null,0]
[null,null,null,null,null,null,null,0]
[null,null,null,null,null,null,null,0]
[null,null,null,null,null,null,null,0]
[null,null,null,null,null,null,null,0]
[null,null,null,null,null,null,null,0]
[null,null,null,null,null,null,null,0]
[null,null,null,null,null,null,null,0]
[null,null,null,null,null,null,null,0]
[null,null,null,null,null,null,null,0]
[null,null,null,null,null,null,null,0]
[null,null,null,null,null,null,null,0]
[null,null,null,null,null,null,null,0]
[null,"Total Recursos por Reciprocidade",null,null,null,null,null,{"$f":"SUM(H107:H121)","v":0}]
[]
[null,null,null,null,null,null,"Origem","Origem"]
[null,null,null,null,null,null,"T","F"]

{"sheet":"SUB. 4","index":14,"n_rows":125,"n_cols":21,"rows_kept":125,"cut":false,"hidden":false,"merged":[[110,1,110,3],[110,8,110,12],[121,1,121,3],[121,8,121,12],[118,1,118,3],[118,8,118,12],[119,1,119,3],[112,1,112,3],[112,8,112,12],[113,1,113,3],[113,8,113,12],[114,1,114,3],[114,8,114,12],[120,1,120,3],[120,8,120,12],[115,1,115,3],[115,8,115,12],[116,1,116,3],[116,8,116,12],[117,1,117,3],[117,8,117,12],[119,8,119,12],[111,1,111,3],[111,8,111,12],[97,9,97,12],[98,1,98,3],[98,9,98,12],[99,1,99,3],[99,9,99,12],[100,9,102,12],[104,8,105,12],[100,4,100,6],[105,1,105,3],[101,4,101,6],[108,1,108,3],[108,8,108,12],[109,1,109,3],[109,8,109,12],[92,1,92,3],[92,9,92,12],[93,1,93,3],[93,9,93,12],[94,1,94,3],[94,9,94,12],[95,1,95,3],[95,9,95,12],[96,1,96,3],[96,9,96,12],[106,1,106,3],[106,8,106,12],[104,1,104,7],[102,4,102,6],[100,1,100,3],[101,1,101,3],[102,1,102,3],[107,1,107,3],[107,8,107,12],[97,1,97,3],[87,1,87,3],[87,9,87,12],[88,1,88,3],[88,9,88,12],[89,1,89,3],[89,9,89,12],[90,1,90,3],[90,9,90,12],[91,1,91,3],[91,9,91,12],[67,1,67,3],[67,9,67,12],[54,1,54,3],[56,1,56,3],[85,1,85,3],[85,9,85,12],[86,1,86,3],[83,1,83,8],[86,9,86,12],[70,1,70,3],[70,9,70,12],[71,1,71,3],[79,1,79,3],[75,1,75,3],[71,9,71,12],[72,1,72,3],[72,9,72,12],[73,1,73,3],[73,9,73,12],[80,4,80,6],[81,4,81,6],[68,1,68,3],[68,9,68,12],[83,9,84,12],[84,1,84,3],[79,9,81,12],[80,1,80,3],[81,1,81,3],[78,1,78,3],[78,9,78,12],[79,4,79,6],[75,9,75,12],[76,1,76,3],[76,9,76,12],[77,1,77,3],[77,9,77,12],[69,1,69,3],[69,9,69,12],[74,1,74,3],[74,9,74,12],[59,9,59,12],[47,8,47,12],[51,1,51,3],[66,9,66,12],[52,1,52,3],[53,1,53,3],[64,1,64,3],[60,1,60,3],[60,9,60,12],[61,1,61,3],[61,9,61,12],[63,1,63,3],[63,9,63,12],[64,9,64,12],[65,1,65,3],[65,9,65,12],[66,1,66,3],[62,1,62,3],[54,8,54,12],[55,8,55,12],[62,9,62,12],[52,8,52,12],[59,1,59,3],[57,9,58,12],[58,1,58,3],[50,1,50,3],[49,8,49,12],[50,8,50,12],[55,1,55,3],[49,1,49,3],[56,8,56,12],[57,1,57,8],[53,8,53,12],[35,1,35,3],[40,1,40,3],[38,1,38,12],[39,1,39,7],[51,8,51,12],[46,1,46,3],[47,1,47,3],[48,1,48,3],[41,8,41,12],[42,8,42,12],[44,1,44,3],[48,8,48,12],[39,8,40,12],[45,1,45,3],[22,20,22,21],[15,18,16,19],[15,1,16,5],[15,20,17,21],[15,6,15,15],[17,1,17,3],[16,14,16,15],[20,20,20,21],[30,20,30,21],[26,20,26,21],[27,20,27,21],[28,20,28,21],[23,20,23,21],[24,1,24,3],[24,20,24,21],[25,1,25,3],[25,20,25,21],[22,1,22,3],[26,1,26,3],[27,1,27,3],[28,1,28,3],[23,1,23,3],[1,1,1,21],[5,3,5,8],[11,2,11,10],[16,10,16,11],[16,12,16,13],[21,20,21,21],[18,1,18,3],[18,20,18,21],[19,1,19,3],[19,20,19,21],[5,1,5,2],[5,11,7,17],[11,11,11,17],[21,1,21,3],[20,1,20,3],[15,16,16,17],[12,11,13,17],[16,6,16,7],[16,8,16,9],[47,15,47,16],[48,15,48,16],[49,15,49,16],[33,20,33,21],[29,1,29,3],[29,20,29,21],[30,1,30,3],[31,20,31,21],[42,1,42,3],[36,20,36,21],[32,20,32,21],[34,20,34,21],[35,20,35,21],[31,1,31,3],[41,1,41,3],[33,1,33,3],[32,1,32,3],[34,1,34,3],[43,8,43,12],[44,8,44,12],[45,8,45,12],[46,8,46,12],[36,1,36,3],[43,1,43,3]]}
[]
[null,"ENTRADA DE DADOS POR SUBSISTEMA"]
[]
[]
[]
[null,"Subsistema n° 4:",null,"Aves",null,null,null,null,null,null,"OBS"]
[]
[null,"ÁREA",4.54,"hectare(s)"]
[]
[]
[]
[null,null,"Horas Trabalhadas",null,null,null,null,null,null,null,null,"Observações"]
[null,null,"Mulher","Homem","Jovens Mulheres","Jovens Homens","Outras","Outros","Total Mulheres","Total Homens","TOTAL"]
[null,"N° Horas",{"$f":"1*365","v":365},0,{"$f":"0.25*365","v":91.25},null,null,null,{"$f":"C14+E14+G14","v":456.25},{"$f":"D14+F14+H14","v":0},{"$f":"C14+D14+E14+F14+G14+H14","v":456.25}]
[]
[null,"Produtos e Insumos Gerados",null,null,null,null,"Produtos",null,null,null,null,null,null,null,null,null,"Insumos Produzidos",null,"Total Produtos e Insumos",null,"Observações"]
[null,null,null,null,null,null,"Venda",null,"Autoconsumo",null,"Doações Trocas",null,"Estoque",null,"Total Produtos"]
[null,"Itens",null,null,"Unidade","Valor Unitário","Qtde","Valor Total","Qtde","Valor Total","Qtde","Valor Total","Qtde","Valor Total","Qtde","Valor Total","Qtde","Valor Total","Qtde","Valor Total"]
[null,"Galinhas ",null,null,"Unidade",30,6,{"$f":"G19*F19","v":180},{"$f":"4*12","v":48},{"$f":"I19*F19","v":1440},12,{"$f":"K19*F19","v":360},20,{"$f":"M19*F19","v":600},{"$f":"G19+I19+K19+M19","v":86},{"$f":"F19*O19","v":2580},null,{"$f":"Q19*F19","v":0},{"$f":"Q19+O19","v":86},{"$f":"S19*F19","v":2580}]
[null,"Pato",null,null,"Unidade",50,null,0,6,300,null,0,2,100,8,400,null,0,8,400]
[null,"Peru",null,null,"Unidade",30,null,0,null,0,null,0,2,60,2,60,null,0,2,60]
[null,"ovo",null,null,"unidade",{"$f":"5/12","v":0.41666666666666669},{"$f":"6*12","v":72},30,{"$f":"(12*4) *12","v":576},240,40,16.666666666666668,15,6.25,703,292.91666666666669,null,0,703,292.91666666666669]
[null,"esterco",null,null,"kg",0.4,null,0,null,0,null,0,null,0,0,0,180,72,180,72]
[null,null,null,null,null,null,null,0,null,0,null,0,null,0,0,0,null,0,0,0]
[null,null,null,null,null,null,null,0,null,0,null,0,null,0,0,0,null,0,0,0]
[null,null,null,null,null,null,null,0,null,0,null,0,null,0,0,0,null,0,0,0]
[null,null,null,null,null,null,null,0,null,0,null,0,null,0,0,0,null,0,0,0]
[null,null,null,null,null,null,null,0,null,0,null,0,null,0,0,0,null,0,0,0]
[null,null,null,null,null,null,null,0,null,0,null,0,null,0,0,0,null,0,0,0]
[null,null,null,null,null,null,null,0,null,0,null,0,null,0,0,0,null,0,0,0]
[null,null,null,null,null,null,null,0,null,0,null,0,null,0,0,0,null,0,0,0]
[null,null,null,null,null,null,null,0,null,0,null,0,null,0,0,0,null,0,0,0]
[null,null,null,null,null,null,null,0,null,0,null,0,null,0,0,0,null,0,0,0]
[null,null,null,null,null,null,null,0,null,0,null,0,null,0,0,0,null,0,0,0]
[null,null,null,null,null,null,null,0,null,0,null,0,null,0,0,0,null,0,0,0]
[null,null,null,null,null,null,null,0,null,0,null,0,null,0,0,0,null,0,0,0]
[null,"Totais",null,null,null,null,null,{"$f":"SUM(H19:H36)","v":210},null,{"$f":"SUM(J19:J36)","v":1980},null,{"$f":"SUM(L19:L36)","v":376.66666666666669},null,{"$f":"SUM(N19:N36)","v":766.25},null,{"$f":"SUM(P19:P36)","v":3332.9166666666665},null,{"$f":"SUM(R19:R36)","v":72},null,{"$f":"SUM(T19:T36)","v":3404.9166666666665}]
[]
[null,"Insumos"]
[null,"Produção Própria - Reciprocidade Ecológica",null,null,null,null,null,null,"Observações"]
[null,"Itens",null,null,"Unidade","Valor Unitário","Qtde","Valor Total"]
[null,null,null,null,null,null,null,{"$f":"F42*G42","v":0}]
[null,null,null,null,null,null,null,{"$f":"F43*G43","v":0}]
[null,null,null,null,null,null,null,0]
[null,null,null,null,null,null,null,0]
[null,null,null,null,null,null,null,0]
[null,null,null,null,null,null,null,0]
[null,null,null,null,null,null,null,0]
[null,null,null,null,null,null,null,0]
[null,null,null,null,null,null,null,0]
[null,null,null,null,null,null,null,0]
[null,null,null,null,null,null,null,0]
[null,null,null,null,null,null,null,0]
[null,null,null,null,null,null,null,0]
[null,null,null,null,null,null,null,0]
[null,null,null,null,null,null,null,0]
[null,"Total Insumos -  Produção Própria",null,null,null,null,null,{"$f":"SUM(H42:H56)","v":0}]
[null,"Comprados - Consumos Intermediários ",null,null,null,null,null,null,null,"Observações"]
[null,"Insumos",null,null,"Unidade","Valor Unitário","Qtde","Valor Total","Origem"]
[null,"ração de milho",null,null,"kg",{"$f":"60/39","v":1.5384615384615385},240,{"$f":"G60*F60","v":369.23076923076923},"F"]
[null,null,null,null,null,null,null,{"$f":"G61*F61","v":0}]
[null,null,null,null,null,null,null,0]
[null,null,null,null,null,null,null,0]
[null,null,null,null,null,null,null,0]
[null,null,null,null,null,null,null,0]
[null,null,null,null,null,null,null,0]
[null,null,null,null,null,null,null,0]
[null,null,null,null,null,null,null,0]
[null,null,null,null,null,null,null,0]
[null,null,null,null,null,null,null,0]
[null,null,null,null,null,null,null,0]
[null,null,null,null,null,null,null,0]
[null,null,null,null,null,null,null,0]
[null,null,null,null,null,null,null,0]
[null,null,null,null,null,null,null,0]
[null,null,null,null,null,null,null,0]
[null,null,null,null,null,null,null,0]
[null,null,null,null,null,null,null,0]
[null,null,null,null,null,null,null,0]
[null," Insumos Comprados no Território",null,null,null,null,null,{"$f":"DSUM(H59:I79,\"Valor Total\",G124:G125)","v":0}]
[null," Insumos Comprados Fora do Território",null,null,null,null,null,{"$f":"DSUM(H59:I79,\"Valor Total\",H124:H125)","v":369.23076923076923}]
[null,"Total de Insumos Comprados",null,null,null,null,null,{"$f":"SUM(H60:H79)","v":369.23076923076923}]
[]
[null,"Pagamento a Terceiros",null,null,null,null,null,null,null,"Observações"]
[null,"Serviços/Renda da Terra",null,null,"Unidade","Valor Unitário","Qtde","Valor Total","Origem"]
[null,null,null,null,null,null,null,{"$f":"G86*F86","v":0}]
[null,null,null,null,null,null,null,0]
[null,null,null,null,null,null,null,0]
[null,null,null,null,null,null,null,0]
[null,null,null,null,null,null,null,0]
[null,null,null,null,null,null,null,0]
[null,null,null,null,null,null,null,0]
[null,null,null,null,null,null,null,0]
[null,null,null,null,null,null,null,0]
[null,null,null,null,null,null,null,0]
[null,null,null,null,null,null,null,0]
[null,null,null,null,null,null,null,0]
[null,null,null,null,null,null,null,0]
[null,null,null,null,null,null,null,0]
[null,null,null,null,null,null,null,0]
[null,"Pagamentos a Terceiros do Território",null,null,null,null,null,{"$f":"DSUM(H85:I100,\"Valor Total\",G124:G125)","v":0}]
[null,"Pagamentos a Terceiros Fora do Território",null,null,null,null,null,{"$f":"DSUM(H85:I100,\"Valor Total\",H124:H125)","v":0}]
[null,"Total de Pagamentos a Terceiros ",null,null,null,null,null,{"$f":"SUM(H86:H100)","v":0}]
[]
[null,"Entrada de Recursos  por Reciprocidade",null,null,null,null,null,null,"Observações"]
[null,"Serviços e Insumos",null,null,"Unidade","Valor Unitário","Qtde","Valor Total"]
[null,null,null,null,null,null,null,{"$f":"G107*F107","v":0}]
[null,null,null,null,null,null,null,0]
[null,null,null,null,null,null,null,0]
[null,null,null,null,null,null,null,0]
[null,null,null,null,null,null,null,0]
[null,null,null,null,null,null,null,0]
[null,null,null,null,null,null,null,0]
[null,null,null,null,null,null,null,0]
[null,null,null,null,null,null,null,0]
[null,null,null,null,null,null,null,0]
[null,null,null,null,null,null,null,0]
[null,null,null,null,null,null,null,0]
[null,null,null,null,null,null,null,0]
[null,null,null,null,null,null,null,0]
[null,null,null,null,null,null,null,0]
[null,"Total Recursos por Reciprocidade",null,null,null,null,null,{"$f":"SUM(H107:H121)","v":0}]
[]
[null,null,null,null,null,null,"Origem","Origem"]
[null,null,null,null,null,null,"T","F"]

{"sheet":"SUB. 5","index":15,"n_rows":125,"n_cols":21,"rows_kept":125,"cut":false,"hidden":false,"merged":[[121,1,121,3],[5,11,7,17],[39,1,39,7],[57,1,57,8],[83,1,83,8],[104,1,104,7],[79,4,79,6],[80,4,80,6],[81,4,81,6],[100,4,100,6],[101,4,101,6],[102,4,102,6],[100,1,100,3],[101,1,101,3],[102,1,102,3],[121,8,121,12],[118,1,118,3],[118,8,118,12],[119,1,119,3],[119,8,119,12],[120,1,120,3],[112,1,112,3],[112,8,112,12],[113,1,113,3],[113,8,113,12],[114,1,114,3],[114,8,114,12],[120,8,120,12],[115,1,115,3],[115,8,115,12],[116,1,116,3],[116,8,116,12],[117,1,117,3],[117,8,117,12],[107,1,107,3],[107,8,107,12],[108,1,108,3],[108,8,108,12],[109,1,109,3],[109,8,109,12],[110,1,110,3],[110,8,110,12],[111,1,111,3],[111,8,111,12],[98,1,98,3],[98,9,98,12],[99,1,99,3],[99,9,99,12],[100,9,102,12],[104,8,105,12],[105,1,105,3],[106,1,106,3],[106,8,106,12],[93,1,93,3],[93,9,93,12],[94,1,94,3],[94,9,94,12],[95,1,95,3],[95,9,95,12],[96,1,96,3],[96,9,96,12],[97,1,97,3],[97,9,97,12],[88,1,88,3],[88,9,88,12],[89,1,89,3],[89,9,89,12],[90,1,90,3],[90,9,90,12],[91,1,91,3],[91,9,91,12],[92,1,92,3],[92,9,92,12],[83,9,84,12],[84,1,84,3],[85,1,85,3],[85,9,85,12],[86,1,86,3],[86,9,86,12],[87,1,87,3],[87,9,87,12],[51,1,51,3],[52,1,52,3],[53,1,53,3],[54,1,54,3],[56,1,56,3],[77,1,77,3],[77,9,77,12],[71,1,71,3],[71,9,71,12],[78,1,78,3],[78,9,78,12],[70,9,70,12],[79,1,79,3],[79,9,81,12],[80,1,80,3],[81,1,81,3],[69,1,69,3],[69,9,69,12],[70,1,70,3],[45,1,45,3],[55,1,55,3],[49,1,49,3],[64,1,64,3],[64,9,64,12],[65,1,65,3],[65,9,65,12],[66,1,66,3],[66,9,66,12],[67,1,67,3],[67,9,67,12],[68,1,68,3],[68,9,68,12],[59,1,59,3],[59,9,59,12],[60,1,60,3],[63,1,63,3],[63,9,63,12],[47,8,47,12],[48,8,48,12],[49,8,49,12],[74,1,74,3],[74,9,74,12],[75,1,75,3],[75,9,75,12],[76,1,76,3],[76,9,76,12],[72,1,72,3],[72,9,72,12],[73,1,73,3],[73,9,73,12],[60,9,60,12],[61,1,61,3],[61,9,61,12],[62,1,62,3],[62,9,62,12],[40,1,40,3],[47,1,47,3],[48,1,48,3],[33,1,33,3],[34,1,34,3],[35,1,35,3],[36,1,36,3],[57,9,58,12],[58,1,58,3],[56,8,56,12],[46,8,46,12],[46,1,46,3],[55,8,55,12],[42,8,42,12],[43,8,43,12],[50,1,50,3],[41,1,41,3],[42,1,42,3],[43,1,43,3],[19,1,19,3],[20,1,20,3],[25,1,25,3],[25,20,25,21],[26,1,26,3],[26,20,26,21],[27,20,27,21],[29,1,29,3],[29,20,29,21],[28,20,28,21],[27,1,27,3],[28,1,28,3],[5,3,5,8],[11,2,11,10],[15,6,15,15],[15,1,16,5],[12,11,13,17],[15,16,16,17],[16,14,16,15],[16,6,16,7],[16,8,16,9],[50,8,50,12],[54,8,54,12],[1,1,1,21],[52,8,52,12],[53,8,53,12],[20,20,20,21],[15,18,16,19],[19,20,19,21],[15,20,17,21],[5,1,5,2],[16,10,16,11],[16,12,16,13],[41,8,41,12],[11,11,11,17],[38,1,38,12],[17,1,17,3],[51,8,51,12],[39,8,40,12],[18,1,18,3],[21,20,21,21],[18,20,18,21],[22,1,22,3],[22,20,22,21],[21,1,21,3],[47,15,47,16],[48,15,48,16],[49,15,49,16],[23,1,23,3],[23,20,23,21],[24,1,24,3],[24,20,24,21],[44,8,44,12],[45,8,45,12],[30,1,30,3],[30,20,30,21],[31,1,31,3],[31,20,31,21],[32,1,32,3],[32,20,32,21],[33,20,33,21],[34,20,34,21],[35,20,35,21],[36,20,36,21],[44,1,44,3]]}
[]
[null,"ENTRADA DE DADOS POR SUBSISTEMA"]
[]
[]
[]
[null,"Subsistema n° 5:",null,"Lavoura Milho e palma",null,null,null,null,null,null,"OBS","Arrendamento em área de terceiros"]
[]
[null,"ÁREA",1,"hectare(s)"]
[]
[]
[]
[null,null,"Horas Trabalhadas",null,null,null,null,null,null,null,null,"Observações"]
[null,null,"Mulher","Homem","Jovens Mulheres","Jovens Homens","Outras","Outros","Total Mulheres","Total Homens","TOTAL"]
[null,"N° Horas",{"$f":"(8*90)+ (2*255)","v":1230},{"$f":"(10*90)+(4*255)","v":1920},{"$f":"(1*90)+(0.5*255)","v":217.5},null,null,null,{"$f":"C14+E14+G14","v":1447.5},{"$f":"D14+F14+H14","v":1920},{"$f":"C14+D14+E14+F14+G14+H14","v":3367.5}]
[]
[null,"Produtos e Insumos Gerados",null,null,null,null,"Produtos",null,null,null,null,null,null,null,null,null,"Insumos Produzidos",null,"Total Produtos e Insumos",null,"Observações"]
[null,null,null,null,null,null,"Venda",null,"Autoconsumo",null,"Doações Trocas",null,"Estoque",null,"Total Produtos"]
[null,"Itens",null,null,"Unidade","Valor Unitário","Qtde","Valor Total","Qtde","Valor Total","Qtde","Valor Total","Qtde","Valor Total","Qtde","Valor Total","Qtde","Valor Total","Qtde","Valor Total"]
[null,"Palma",null,null,"kg",0.2,null,{"$f":"G19*F19","v":0},null,{"$f":"I19*F19","v":0},null,{"$f":"K19*F19","v":0},null,{"$f":"M19*F19","v":0},{"$f":"G19+I19+K19+M19","v":0},{"$f":"F19*O19","v":0},20100,{"$f":"Q19*F19","v":4020},{"$f":"Q19+O19","v":20100},{"$f":"S19*F19","v":4020}]
[null,"Millho seco",null,null,"kg",1,200,200,50,50,20,20,null,0,270,270,null,0,270,270]
[null,null,null,null,"kg",2,null,0,null,0,null,0,null,0,0,0,null,0,0,0]
[null,null,null,null,null,null,null,0,null,0,null,0,null,0,0,0,null,0,0,0]
[null,null,null,null,null,null,null,0,null,0,null,0,null,0,0,0,null,0,0,0]
[null,null,null,null,null,null,null,0,null,0,null,0,null,0,0,0,null,0,0,0]
[null,null,null,null,null,null,null,0,null,0,null,0,null,0,0,0,null,0,0,0]
[null,null,null,null,null,null,null,0,null,0,null,0,null,0,0,0,null,0,0,0]
[null,null,null,null,null,null,null,0,null,0,null,0,null,0,0,0,null,0,0,0]
[null,null,null,null,null,null,null,0,null,0,null,0,null,0,0,0,null,0,0,0]
[null,null,null,null,null,null,null,0,null,0,null,0,null,0,0,0,null,0,0,0]
[null,null,null,null,null,null,null,0,null,0,null,0,null,0,0,0,null,0,0,0]
[null,null,null,null,null,null,null,0,null,0,null,0,null,0,0,0,null,0,0,0]
[null,null,null,null,null,null,null,0,null,0,null,0,null,0,0,0,null,0,0,0]
[null,null,null,null,null,null,null,0,null,0,null,0,null,0,0,0,null,0,0,0]
[null,null,null,null,null,null,null,0,null,0,null,0,null,0,0,0,null,0,0,0]
[null,null,null,null,null,null,null,0,null,0,null,0,null,0,0,0,null,0,0,0]
[null,null,null,null,null,null,null,0,null,0,null,0,null,0,0,0,null,0,0,0]
[null,"Totais",null,null,null,null,null,{"$f":"SUM(H19:H36)","v":200},null,{"$f":"SUM(J19:J36)","v":50},null,{"$f":"SUM(L19:L36)","v":20},null,{"$f":"SUM(N19:N36)","v":0},null,{"$f":"SUM(P19:P36)","v":270},null,{"$f":"SUM(R19:R36)","v":4020},null,{"$f":"SUM(T19:T36)","v":4290}]
[]
[null,"Insumos Consumidos"]
[null,"Produção Própria - Reciprocidade Ecológica",null,null,null,null,null,null,"Observações"]
[null,"Itens",null,null,"Unidade","Valor Unitário","Qtde","Valor Total"]
[null,"esterco galinha",null,null,"kg",0.42,75,{"$f":"G42*F42","v":31.5}]
[null,"esterco ovnos",null,null,"kg",0.42,75,31.5]
[null,null,null,null,null,null,null,0]
[null,null,null,null,null,null,null,0]
[null,null,null,null,null,null,null,0]
[null,null,null,null,null,null,null,0]
[null,null,null,null,null,null,null,0]
[null,null,null,null,null,null,null,0]
[null,null,null,null,null,null,null,0]
[null,null,null,null,null,null,null,0]
[null,null,null,null,null,null,null,0]
[null,null,null,null,null,null,null,0]
[null,null,null,null,null,null,null,0]
[null,null,null,null,null,null,null,0]
[null,null,null,null,null,null,null,0]
[null,"Total Insumos -  Produção Própria",null,null,null,null,null,{"$f":"SUM(H42:H56)","v":63}]
[null,"Comprados - Consumos Intermediários ",null,null,null,null,null,null,null,"Observações"]
[null,"Insumos",null,null,"Unidade","Valor Unitário","Qtde","Valor Total","Origem"]
[null,"esterco",null,null,"kg",0.09,4000,{"$f":"G60*F60","v":360},"T"]
[null,"sementes de milho híbrido (Joia)",null,null,"kg",4,40,{"$f":"G61*F61","v":160},"F"]
[null,null,null,null,null,null,null,0]
[null,null,null,null,null,null,null,0]
[null,null,null,null,null,null,null,0]
[null,null,null,null,null,null,null,0]
[null,null,null,null,null,null,null,0]
[null,null,null,null,null,null,null,0]
[null,null,null,null,null,null,null,0]
[null,null,null,null,null,null,null,0]
[null,null,null,null,null,null,null,0]
[null,null,null,null,null,null,null,0]
[null,null,null,null,null,null,null,0]
[null,null,null,null,null,null,null,0]
[null,null,null,null,null,null,null,0]
[null,null,null,null,null,null,null,0]
[null,null,null,null,null,null,null,0]
[null,null,null,null,null,null,null,0]
[null,null,null,null,null,null,null,0]
[null,null,null,null,null,null,null,0]
[null," Insumos Comprados no Território",null,null,null,null,null,{"$f":"DSUM(H59:I79,\"Valor Total\",G124:G125)","v":360}]
[null," Insumos Comprados Fora do Território",null,null,null,null,null,{"$f":"DSUM(H59:I79,\"Valor Total\",H124:H125)","v":160}]
[null,"Total de Insumos Comprados",null,null,null,null,null,{"$f":"SUM(H60:H79)","v":520}]
[]
[null,"Pagamento a Terceiros",null,null,null,null,null,null,null,"Observações"]
[null,"Serviços/Renda da Terra",null,null,"Unidade","Valor Unitário","Qtde","Valor Total","Origem"]
[null,"pagamento a serviço de terceiros para transporte de milho.",null,null,"diarias",30,5,{"$f":"G86*F86","v":150}]
[null,"pagamento a serviço de terceiros para colheita de milho.",null,null,"frete",150,1,150]
[null,"servicio de diarias em outro município (São Braz)~, para plantio de capim.",null,null,"diarias",30,12,360]
[null,null,null,null,null,null,null,0]
[null,null,null,null,null,null,null,0]
[null,null,null,null,null,null,null,0]
[null,null,null,null,null,null,null,0]
[null,null,null,null,null,null,null,0]
[null,null,null,null,null,null,null,0]
[null,null,null,null,null,null,null,0]
[null,null,null,null,null,null,null,0]
[null,null,null,null,null,null,null,0]
[null,null,null,null,null,null,null,0]
[null,null,null,null,null,null,null,0]
[null,null,null,null,null,null,null,0]
[null,"Pagamentos a Terceiros do Território",null,null,null,null,null,{"$f":"DSUM(H85:I100,\"Valor Total\",G124:G125)","v":0}]
[null,"Pagamentos a Terceiros Fora do Território",null,null,null,null,null,{"$f":"DSUM(H85:I100,\"Valor Total\",H124:H125)","v":0}]
[null,"Total de Pagamentos a Terceiros ",null,null,null,null,null,{"$f":"SUM(H86:H100)","v":660}]
[]
[null,"Entrada de Recursos  por Reciprocidade",null,null,null,null,null,null,"Observações"]
[null,"Serviços e Insumos",null,null,"Unidade","Valor Unitário","Qtde","Valor Total"]
[null,null,null,null,null,null,null,{"$f":"G107*F107","v":0}]
[null,null,null,null,null,null,null,0]
[null,null,null,null,null,null,null,0]
[null,null,null,null,null,null,null,0]
[null,null,null,null,null,null,null,0]
[null,null,null,null,null,null,null,0]
[null,null,null,null,null,null,null,0]
[null,null,null,null,null,null,null,0]
[null,null,null,null,null,null,null,0]
[null,null,null,null,null,null,null,0]
[null,null,null,null,null,null,null,0]
[null,null,null,null,null,null,null,0]
[null,null,null,null,null,null,null,0]
[null,null,null,null,null,null,null,0]
[null,null,null,null,null,null,null,0]
[null,"Total Recursos por Reciprocidade",null,null,null,null,null,{"$f":"SUM(H107:H121)","v":0}]
[]
[null,null,null,null,null,null,"Origem","Origem"]
[null,null,null,null,null,null,"T","F"]

{"sheet":"SUB. 6","index":16,"n_rows":125,"n_cols":21,"rows_kept":125,"cut":false,"hidden":false,"merged":[[5,11,7,17],[15,16,16,17],[39,8,40,12],[39,1,39,7],[57,1,57,8],[83,1,83,8],[77,1,77,3],[77,9,77,12],[71,1,71,3],[83,9,84,12],[84,1,84,3],[46,1,46,3],[47,1,47,3],[45,1,45,3],[64,1,64,3],[68,1,68,3],[52,1,52,3],[55,1,55,3],[49,1,49,3],[59,1,59,3],[48,1,48,3],[36,1,36,3],[30,1,30,3],[25,1,25,3],[112,1,112,3],[104,8,105,12],[107,1,107,3],[107,8,107,12],[108,1,108,3],[108,8,108,12],[114,1,114,3],[51,1,51,3],[90,1,90,3],[90,9,90,12],[85,9,85,12],[86,1,86,3],[86,9,86,12],[88,1,88,3],[88,9,88,12],[89,1,89,3],[89,9,89,12],[85,1,85,3],[114,8,114,12],[95,9,95,12],[96,1,96,3],[110,8,110,12],[111,1,111,3],[111,8,111,12],[120,1,120,3],[120,8,120,12],[115,1,115,3],[115,8,115,12],[116,1,116,3],[121,1,121,3],[121,8,121,12],[118,1,118,3],[118,8,118,12],[119,1,119,3],[116,8,116,12],[117,1,117,3],[117,8,117,12],[119,8,119,12],[98,9,98,12],[99,1,99,3],[99,9,99,12],[100,9,102,12],[104,1,104,7],[100,4,100,6],[100,1,100,3],[101,1,101,3],[102,1,102,3],[95,1,95,3],[101,4,101,6],[109,1,109,3],[109,8,109,12],[110,1,110,3],[112,8,112,12],[113,1,113,3],[113,8,113,12],[91,1,91,3],[105,1,105,3],[106,1,106,3],[106,8,106,12],[93,1,93,3],[93,9,93,12],[94,1,94,3],[94,9,94,12],[91,9,91,12],[96,9,96,12],[97,1,97,3],[97,9,97,12],[92,1,92,3],[92,9,92,12],[102,4,102,6],[98,1,98,3],[54,1,54,3],[56,1,56,3],[78,1,78,3],[78,9,78,12],[70,9,70,12],[69,9,69,12],[70,1,70,3],[76,1,76,3],[79,1,79,3],[79,9,81,12],[80,1,80,3],[81,1,81,3],[74,1,74,3],[74,9,74,12],[75,1,75,3],[75,9,75,12],[76,9,76,12],[71,9,71,12],[72,1,72,3],[79,4,79,6],[80,4,80,6],[81,4,81,6],[87,1,87,3],[50,1,50,3],[72,9,72,12],[73,1,73,3],[73,9,73,12],[64,9,64,12],[65,1,65,3],[65,9,65,12],[66,1,66,3],[66,9,66,12],[67,1,67,3],[67,9,67,12],[68,9,68,12],[69,1,69,3],[59,9,59,12],[60,1,60,3],[60,9,60,12],[61,1,61,3],[61,9,61,12],[62,1,62,3],[62,9,62,12],[63,1,63,3],[63,9,63,12],[87,9,87,12],[36,20,36,21],[57,9,58,12],[58,1,58,3],[38,1,38,12],[52,8,52,12],[40,1,40,3],[44,8,44,12],[45,8,45,12],[51,8,51,12],[41,8,41,12],[42,8,42,12],[43,8,43,12],[53,8,53,12],[54,8,54,12],[55,8,55,12],[56,8,56,12],[46,8,46,12],[47,8,47,12],[48,8,48,12],[41,1,41,3],[42,1,42,3],[43,1,43,3],[44,1,44,3],[53,1,53,3],[30,20,30,21],[31,1,31,3],[31,20,31,21],[32,1,32,3],[32,20,32,21],[33,1,33,3],[33,20,33,21],[35,20,35,21],[34,1,34,3],[35,1,35,3],[29,1,29,3],[29,20,29,21],[15,6,15,15],[21,20,21,21],[15,20,17,21],[17,1,17,3],[20,20,20,21],[21,1,21,3],[23,1,23,3],[23,20,23,21],[24,1,24,3],[24,20,24,21],[16,10,16,11],[16,12,16,13],[15,18,16,19],[25,20,25,21],[26,1,26,3],[27,1,27,3],[28,1,28,3],[27,20,27,21],[28,20,28,21],[47,15,47,16],[48,15,48,16],[49,15,49,16],[1,1,1,21],[5,1,5,2],[49,8,49,12],[50,8,50,12],[16,14,16,15],[16,6,16,7],[16,8,16,9],[26,20,26,21],[34,20,34,21],[15,1,16,5],[18,1,18,3],[18,20,18,21],[19,1,19,3],[19,20,19,21],[20,1,20,3],[22,1,22,3],[22,20,22,21],[5,3,5,8],[11,2,11,10],[12,11,13,17],[11,11,11,17]]}
[]
[null,"ENTRADA DE DADOS POR SUBSISTEMA"]
[]
[]
[]
[null,"Subsistema n° 6:",null,"Quintal - frutas e medicinais",null,null,null,null,null,null,"OBS"]
[]
[null,"ÁREA",0.16,"hectare(s)"]
[]
[]
[]
[null,null,"Horas Trabalhadas",null,null,null,null,null,null,null,null,"Observações"]
[null,null,"Mulher","Homem","Jovens Mulheres","Jovens Homens","Outras","Outros","Total Mulheres","Total Homens","TOTAL"]
[null,"N° Horas",{"$f":"1*365","v":365},6,{"$f":"0.2*365","v":73},null,null,null,{"$f":"C14+E14+G14","v":438},{"$f":"D14+F14+H14","v":6},{"$f":"C14+D14+E14+F14+G14+H14","v":444}]
[]
[null,"Produtos e Insumos Gerados",null,null,null,null,"Produtos",null,null,null,null,null,null,null,null,null,"Insumos Produzidos",null,"Total Produtos e Insumos",null,"Observações"]
[null,null,null,null,null,null,"Venda",null,"Autoconsumo",null,"Doações Trocas",null,"Estoque",null,"Total Produtos"]
[null,"Itens",null,null,"Unidade","Valor Unitário","Qtde","Valor Total","Qtde","Valor Total","Qtde","Valor Total","Qtde","Valor Total","Qtde","Valor Total","Qtde","Valor Total","Qtde","Valor Total"]
[null,"gliricidea",null,null,"kg",3,0,{"$f":"G19*F19","v":0},null,{"$f":"I19*F19","v":0},null,{"$f":"K19*F19","v":0},null,{"$f":"M19*F19","v":0},{"$f":"G19+I19+K19+M19","v":0},{"$f":"F19*O19","v":0},183,{"$f":"Q19*F19","v":549},{"$f":"Q19+O19","v":183},{"$f":"S19*F19","v":549}]
[null,"jenipapo",null,null,"kg",3,null,0,{"$f":"5*3","v":15},45,null,0,null,0,15,45,null,0,15,45]
[null,"cidreira",null,null,"molho",2,0,0,48,96,null,0,null,0,48,96,null,0,48,96]
[null,"açerola",null,null,"kg",2,0,0,48,96,null,0,null,0,48,96,null,0,48,96]
[null,"pinha",null,null,"kg",5,0,0,12,60,null,0,null,0,12,60,null,0,12,60]
[null,"coco verde",null,null,"unidade",2,null,0,70,140,null,0,null,0,70,140,null,0,70,140]
[null,"laranja",null,null,"unidade",0.25,null,0,48,12,null,0,null,0,48,12,null,0,48,12]
[null,"hortelã de sete dor",null,null,"molho",2,null,0,48,96,null,0,null,0,48,96,null,0,48,96]
[null,"hortelã",null,null,"molho",2,null,0,48,96,null,0,null,0,48,96,null,0,48,96]
[null,"samba caitá",null,null,"molho",2,null,0,48,96,null,0,null,0,48,96,null,0,48,96]
[null,"couve",null,null,"molho",2,null,0,96,192,72,144,null,0,168,336,null,0,168,336]
[null,"pimentão ",null,null,"kg",2,null,0,2,4,null,0,null,0,2,4,null,0,2,4]
[null,"coentro",null,null,"molho",2,null,0,96,192,72,144,null,0,168,336,null,0,168,336]
[null,"cebolinha",null,null,"molho",1.5,null,0,96,144,72,108,null,0,null,0,null,0,0,0]
[null,null,null,null,null,null,null,{"$f":"G33*F33","v":0},null,{"$f":"I33*F33","v":0},null,{"$f":"K33*F33","v":0},null,{"$f":"M33*F33","v":0},{"$f":"G33+I33+K33+M33","v":0},{"$f":"F33*O33","v":0},null,{"$f":"Q33*F33","v":0},{"$f":"Q33+O33","v":0},{"$f":"S33*F33","v":0}]
[null,null,null,null,null,null,null,0,null,0,null,0,null,0,0,0,null,0,0,0]
[null,null,null,null,null,null,null,0,null,0,null,0,null,0,0,0,null,0,0,0]
[null,null,null,null,null,null,null,0,null,0,null,0,null,0,null,0,null,0,0,0]
[null,"Totais",null,null,null,null,null,{"$f":"SUM(H19:H36)","v":0},null,{"$f":"SUM(J19:J36)","v":1269},null,{"$f":"SUM(L19:L36)","v":396},null,{"$f":"SUM(N19:N36)","v":0},null,{"$f":"SUM(P19:P36)","v":1413},null,{"$f":"SUM(R19:R36)","v":549},null,{"$f":"SUM(T19:T36)","v":1962}]
[]
[null,"Insumos"]
[null,"Produção Própria - Reciprocidade Ecológica",null,null,null,null,null,null,"Observações"]
[null,"Itens",null,null,"Unidade","Valor Unitário","Qtde","Valor Total"]
[null,"esterco",null,null,"kg",0.42,{"$f":"5*12","v":60},{"$f":"G42*F42","v":25.2}]
[null,null,null,null,null,null,null,{"$f":"G43*F43","v":0}]
[null,null,null,null,null,null,null,0]
[null,null,null,null,null,null,null,0]
[null,null,null,null,null,null,null,0]
[null,null,null,null,null,null,null,0]
[null,null,null,null,null,null,null,0]
[null,null,null,null,null,null,null,0]
[null,null,null,null,null,null,null,0]
[null,null,null,null,null,null,null,0]
[null,null,null,null,null,null,null,0]
[null,null,null,null,null,null,null,0]
[null,null,null,null,null,null,null,0]
[null,null,null,null,null,null,null,0]
[null,null,null,null,null,null,null,0]
[null,"Total Insumos -  Produção Própria",null,null,null,null,null,{"$f":"SUM(H42:H56)","v":25.2}]
[null,"Comprados - Consumos Intermediários ",null,null,null,null,null,null,null,"Observações"]
[null,"Insumos",null,null,"Unidade","Valor Unitário","Qtde","Valor Total","Origem"]
[null,null,null,null,null,null,null,{"$f":"G60*F60","v":0}]
[null,null,null,null,null,null,null,{"$f":"G61*F61","v":0}]
[null,null,null,null,null,null,null,0]
[null,null,null,null,null,null,null,0]
[null,null,null,null,null,null,null,0]
[null,null,null,null,null,null,null,0]
[null,null,null,null,null,null,null,0]
[null,null,null,null,null,null,null,0]
[null,null,null,null,null,null,null,0]
[null,null,null,null,null,null,null,0]
[null,null,null,null,null,null,null,0]
[null,null,null,null,null,null,null,0]
[null,null,null,null,null,null,null,0]
[null,null,null,null,null,null,null,0]
[null,null,null,null,null,null,null,0]
[null,null,null,null,null,null,null,0]
[null,null,null,null,null,null,null,0]
[null,null,null,null,null,null,null,0]
[null,null,null,null,null,null,null,0]
[null,null,null,null,null,null,null,0]
[null," Insumos Comprados no Território",null,null,null,null,null,{"$f":"DSUM(H59:I79,\"Valor Total\",G124:G125)","v":0}]
[null," Insumos Comprados Fora do Território",null,null,null,null,null,{"$f":"DSUM(H59:I79,\"Valor Total\",H124:H125)","v":0}]
[null,"Total de Insumos Comprados",null,null,null,null,null,{"$f":"SUM(H60:H79)","v":0}]
[]
[null,"Pagamento a Terceiros",null,null,null,null,null,null,null,"Observações"]
[null,"Serviços/Renda da Terra",null,null,"Unidade","Valor Unitário","Qtde","Valor Total","Origem"]
[null,null,null,null,null,null,null,{"$f":"G86*F86","v":0}]
[null,null,null,null,null,null,null,0]
[null,null,null,null,null,null,null,0]
[null,null,null,null,null,null,null,0]
[null,null,null,null,null,null,null,0]
[null,null,null,null,null,null,null,0]
[null,null,null,null,null,null,null,0]
[null,null,null,null,null,null,null,0]
[null,null,null,null,null,null,null,0]
[null,null,null,null,null,null,null,0]
[null,null,null,null,null,null,null,0]
[null,null,null,null,null,null,null,0]
[null,null,null,null,null,null,null,0]
[null,null,null,null,null,null,null,0]
[null,null,null,null,null,null,null,0]
[null,"Pagamentos a Terceiros do Território",null,null,null,null,null,{"$f":"DSUM(H85:I100,\"Valor Total\",G124:G125)","v":0}]
[null,"Pagamentos a Terceiros Fora do Território",null,null,null,null,null,{"$f":"DSUM(H85:I100,\"Valor Total\",H124:H125)","v":0}]
[null,"Total de Pagamentos a Terceiros ",null,null,null,null,null,{"$f":"SUM(H86:H100)","v":0}]
[]
[null,"Entrada de Recursos  por Reciprocidade",null,null,null,null,null,null,"Observações"]
[null,"Serviços e Insumos",null,null,"Unidade","Valor Unitário","Qtde","Valor Total"]
[null,null,null,null,null,null,null,{"$f":"G107*F107","v":0}]
[null,null,null,null,null,null,null,0]
[null,null,null,null,null,null,null,0]
[null,null,null,null,null,null,null,0]
[null,null,null,null,null,null,null,0]
[null,null,null,null,null,null,null,0]
[null,null,null,null,null,null,null,0]
[null,null,null,null,null,null,null,0]
[null,null,null,null,null,null,null,0]
[null,null,null,null,null,null,null,0]
[null,null,null,null,null,null,null,0]
[null,null,null,null,null,null,null,0]
[null,null,null,null,null,null,null,0]
[null,null,null,null,null,null,null,0]
[null,null,null,null,null,null,null,0]
[null,"Total Recursos por Reciprocidade",null,null,null,null,null,{"$f":"SUM(H107:H121)","v":0}]
[]
[null,null,null,null,null,null,"Origem","Origem"]
[null,null,null,null,null,null,"T","F"]

{"sheet":"SUB. 7","index":17,"n_rows":125,"n_cols":21,"rows_kept":125,"cut":false,"hidden":false,"merged":[[121,1,121,3],[5,11,7,17],[15,20,17,21],[39,1,39,7],[57,1,57,8],[83,1,83,8],[104,1,104,7],[79,4,79,6],[80,4,80,6],[81,4,81,6],[100,4,100,6],[101,4,101,6],[100,1,100,3],[101,1,101,3],[102,1,102,3],[121,8,121,12],[118,1,118,3],[118,8,118,12],[119,1,119,3],[119,8,119,12],[120,1,120,3],[112,1,112,3],[112,8,112,12],[113,1,113,3],[113,8,113,12],[114,1,114,3],[114,8,114,12],[120,8,120,12],[115,1,115,3],[115,8,115,12],[116,1,116,3],[116,8,116,12],[117,1,117,3],[117,8,117,12],[107,1,107,3],[107,8,107,12],[108,1,108,3],[108,8,108,12],[109,1,109,3],[109,8,109,12],[110,1,110,3],[110,8,110,12],[111,1,111,3],[111,8,111,12],[98,1,98,3],[98,9,98,12],[99,1,99,3],[99,9,99,12],[100,9,102,12],[104,8,105,12],[105,1,105,3],[102,4,102,6],[106,1,106,3],[106,8,106,12],[93,1,93,3],[93,9,93,12],[94,1,94,3],[94,9,94,12],[95,1,95,3],[95,9,95,12],[96,1,96,3],[96,9,96,12],[97,1,97,3],[97,9,97,12],[88,1,88,3],[88,9,88,12],[89,1,89,3],[89,9,89,12],[90,1,90,3],[90,9,90,12],[91,1,91,3],[91,9,91,12],[92,1,92,3],[92,9,92,12],[83,9,84,12],[84,1,84,3],[85,1,85,3],[85,9,85,12],[86,1,86,3],[86,9,86,12],[87,1,87,3],[87,9,87,12],[51,1,51,3],[52,1,52,3],[53,1,53,3],[54,1,54,3],[56,1,56,3],[77,1,77,3],[77,9,77,12],[71,1,71,3],[71,9,71,12],[78,1,78,3],[78,9,78,12],[70,9,70,12],[79,1,79,3],[79,9,81,12],[80,1,80,3],[81,1,81,3],[50,1,50,3],[41,1,41,3],[42,1,42,3],[43,1,43,3],[44,1,44,3],[69,1,69,3],[69,9,69,12],[70,1,70,3],[45,1,45,3],[55,1,55,3],[49,1,49,3],[64,1,64,3],[64,9,64,12],[65,1,65,3],[65,9,65,12],[66,1,66,3],[66,9,66,12],[68,1,68,3],[68,9,68,12],[59,1,59,3],[59,9,59,12],[60,1,60,3],[60,9,60,12],[61,1,61,3],[74,1,74,3],[74,9,74,12],[75,1,75,3],[75,9,75,12],[76,1,76,3],[76,9,76,12],[72,1,72,3],[72,9,72,12],[73,1,73,3],[73,9,73,12],[61,9,61,12],[62,1,62,3],[62,9,62,12],[34,20,34,21],[35,1,35,3],[35,20,35,21],[36,1,36,3],[36,20,36,21],[67,1,67,3],[67,9,67,12],[40,1,40,3],[46,1,46,3],[47,1,47,3],[63,1,63,3],[63,9,63,12],[34,1,34,3],[48,1,48,3],[39,8,40,12],[41,8,41,12],[47,8,47,12],[57,9,58,12],[58,1,58,3],[38,1,38,12],[51,8,51,12],[33,1,33,3],[33,20,33,21],[23,1,23,3],[23,20,23,21],[24,1,24,3],[24,20,24,21],[25,1,25,3],[25,20,25,21],[21,20,21,21],[28,1,28,3],[22,1,22,3],[29,1,29,3],[29,20,29,21],[30,1,30,3],[30,20,30,21],[31,1,31,3],[31,20,31,21],[32,1,32,3],[32,20,32,21],[28,20,28,21],[1,1,1,21],[5,1,5,2],[5,3,5,8],[11,2,11,10],[26,20,26,21],[27,20,27,21],[27,1,27,3],[26,1,26,3],[15,16,16,17],[15,18,16,19],[18,1,18,3],[18,20,18,21],[19,20,19,21],[16,10,16,11],[22,20,22,21],[20,1,20,3],[20,20,20,21],[21,1,21,3],[19,1,19,3],[15,1,16,5],[15,6,15,15],[17,1,17,3],[16,14,16,15],[16,6,16,7],[54,8,54,12],[55,8,55,12],[56,8,56,12],[12,11,13,17],[11,11,11,17],[48,8,48,12],[49,8,49,12],[50,8,50,12],[52,8,52,12],[53,8,53,12],[42,8,42,12],[43,8,43,12],[44,8,44,12],[45,8,45,12],[46,8,46,12],[16,8,16,9],[16,12,16,13],[47,15,47,16],[48,15,48,16],[49,15,49,16]]}
[]
[null,"ENTRADA DE DADOS POR SUBSISTEMA"]
[]
[]
[]
[null,"Subsistema n° 7:",null,null,null,null,null,null,null,null,"OBS"]
[]
[null,"ÁREA",null,"hectare(s)"]
[]
[]
[]
[null,null,"Horas Trabalhadas",null,null,null,null,null,null,null,null,"Observações"]
[null,null,"Mulher","Homem","Jovens Mulheres","Jovens Homens","Outras","Outros","Total Mulheres","Total Homens","TOTAL"]
[null,"N° Horas",null,null,null,null,null,null,{"$f":"C14+E14+G14","v":0},{"$f":"D14+F14+H14","v":0},{"$f":"C14+D14+E14+F14+G14+H14","v":0}]
[]
[null,"Produtos e Insumos Gerados",null,null,null,null,"Produtos",null,null,null,null,null,null,null,null,null,"Insumos Produzidos",null,"Total Produtos e Insumos",null,"Observações"]
[null,null,null,null,null,null,"Venda",null,"Autoconsumo",null,"Doações Trocas",null,"Estoque",null,"Total Produtos"]
[null,"Itens",null,null,"Unidade","Valor Unitário","Qtde","Valor Total","Qtde","Valor Total","Qtde","Valor Total","Qtde","Valor Total","Qtde","Valor Total","Qtde","Valor Total","Qtde","Valor Total"]
[null,null,null,null,null,null,null,{"$f":"G19*F19","v":0},null,{"$f":"I19*F19","v":0},null,{"$f":"K19*F19","v":0},null,{"$f":"M19*F19","v":0},{"$f":"G19+I19+K19+M19","v":0},{"$f":"F19*O19","v":0},null,{"$f":"Q19*F19","v":0},{"$f":"Q19+O19","v":0},{"$f":"S19*F19","v":0}]
[null,null,null,null,null,null,null,0,null,0,null,0,null,0,0,0,null,0,0,0]
[null,null,null,null,null,null,null,0,null,0,null,0,null,0,0,0,null,0,0,0]
[null,null,null,null,null,null,null,0,null,0,null,0,null,0,0,0,null,0,0,0]
[null,null,null,null,null,null,null,0,null,0,null,0,null,0,0,0,null,0,0,0]
[null,null,null,null,null,null,null,0,null,0,null,0,null,0,0,0,null,0,0,0]
[null,null,null,null,null,null,null,0,null,0,null,0,null,0,0,0,null,0,0,0]
[null,null,null,null,null,null,null,0,null,0,null,0,null,0,0,0,null,0,0,0]
[null,null,null,null,null,null,null,0,null,0,null,0,null,0,0,0,null,0,0,0]
[null,null,null,null,null,null,null,0,null,0,null,0,null,0,0,0,null,0,0,0]
[null,null,null,null,null,null,null,0,null,0,null,0,null,0,0,0,null,0,0,0]
[null,null,null,null,null,null,null,0,null,0,null,0,null,0,0,0,null,0,0,0]
[null,null,null,null,null,null,null,0,null,0,null,0,null,0,0,0,null,0,0,0]
[null,null,null,null,null,null,null,0,null,0,null,0,null,0,0,0,null,0,0,0]
[null,null,null,null,null,null,null,0,null,0,null,0,null,0,0,0,null,0,0,0]
[null,null,null,null,null,null,null,0,null,0,null,0,null,0,0,0,null,0,0,0]
[null,null,null,null,null,null,null,0,null,0,null,0,null,0,0,0,null,0,0,0]
[null,null,null,null,null,null,null,0,null,0,null,0,null,0,0,0,null,0,0,0]
[null,"Totais",null,null,null,null,null,{"$f":"SUM(H19:H36)","v":0},null,{"$f":"SUM(J19:J36)","v":0},null,{"$f":"SUM(L19:L36)","v":0},null,{"$f":"SUM(N19:N36)","v":0},null,{"$f":"SUM(P19:P36)","v":0},null,{"$f":"SUM(R19:R36)","v":0},null,{"$f":"SUM(T19:T36)","v":0}]
[]
[null,"Insumos"]
[null,"Produção Própria - Reciprocidade Ecológica",null,null,null,null,null,null,"Observações"]
[null,"Itens",null,null,"Unidade","Valor Unitário","Qtde","Valor Total"]
[null,null,null,null,null,null,null,{"$f":"G42*F42","v":0}]
[null,null,null,null,null,null,null,0]
[null,null,null,null,null,null,null,0]
[null,null,null,null,null,null,null,0]
[null,null,null,null,null,null,null,0]
[null,null,null,null,null,null,null,0]
[null,null,null,null,null,null,null,0]
[null,null,null,null,null,null,null,0]
[null,null,null,null,null,null,null,0]
[null,null,null,null,null,null,null,0]
[null,null,null,null,null,null,null,0]
[null,null,null,null,null,null,null,0]
[null,null,null,null,null,null,null,0]
[null,null,null,null,null,null,null,0]
[null,null,null,null,null,null,null,0]
[null,"Total Insumos -  Produção Própria",null,null,null,null,null,{"$f":"SUM(H42:H56)","v":0}]
[null,"Comprados - Consumos Intermediários ",null,null,null,null,null,null,null,"Observações"]
[null,"Insumos",null,null,"Unidade","Valor Unitário","Qtde","Valor Total","Origem"]
[null,null,null,null,null,null,null,{"$f":"G60*F60","v":0}]
[null,null,null,null,null,null,null,{"$f":"G61*F61","v":0}]
[null,null,null,null,null,null,null,0]
[null,null,null,null,null,null,null,0]
[null,null,null,null,null,null,null,0]
[null,null,null,null,null,null,null,0]
[null,null,null,null,null,null,null,0]
[null,null,null,null,null,null,null,0]
[null,null,null,null,null,null,null,0]
[null,null,null,null,null,null,null,0]
[null,null,null,null,null,null,null,0]
[null,null,null,null,null,null,null,0]
[null,null,null,null,null,null,null,0]
[null,null,null,null,null,null,null,0]
[null,null,null,null,null,null,null,0]
[null,null,null,null,null,null,null,0]
[null,null,null,null,null,null,null,0]
[null,null,null,null,null,null,null,0]
[null,null,null,null,null,null,null,0]
[null,null,null,null,null,null,null,0]
[null," Insumos Comprados no Território",null,null,null,null,null,{"$f":"DSUM(H59:I79,\"Valor Total\",G124:G125)","v":0}]
[null," Insumos Comprados Fora do Território",null,null,null,null,null,{"$f":"DSUM(H59:I79,\"Valor Total\",H124:H125)","v":0}]
[null,"Total de Insumos Comprados",null,null,null,null,null,{"$f":"SUM(H60:H79)","v":0}]
[]
[null,"Pagamento a Terceiros",null,null,null,null,null,null,null,"Observações"]
[null,"Serviços/Renda da Terra",null,null,"Unidade","Valor Unitário","Qtde","Valor Total","Origem"]
[null,null,null,null,null,null,null,{"$f":"G86*F86","v":0}]
[null,null,null,null,null,null,null,0]
[null,null,null,null,null,null,null,0]
[null,null,null,null,null,null,null,0]
[null,null,null,null,null,null,null,0]
[null,null,null,null,null,null,null,0]
[null,null,null,null,null,null,null,0]
[null,null,null,null,null,null,null,0]
[null,null,null,null,null,null,null,0]
[null,null,null,null,null,null,null,0]
[null,null,null,null,null,null,null,0]
[null,null,null,null,null,null,null,0]
[null,null,null,null,null,null,null,0]
[null,null,null,null,null,null,null,0]
[null,null,null,null,null,null,null,0]
[null,"Pagamentos a Terceiros do Território",null,null,null,null,null,{"$f":"DSUM(H85:I100,\"Valor Total\",G124:G125)","v":0}]
[null,"Pagamentos a Terceiros Fora do Território",null,null,null,null,null,{"$f":"DSUM(H85:I100,\"Valor Total\",H124:H125)","v":0}]
[null,"Total de Pagamentos a Terceiros ",null,null,null,null,null,{"$f":"SUM(H86:H100)","v":0}]
[]
[null,"Entrada de Recursos  por Reciprocidade",null,null,null,null,null,null,"Observações"]
[null,"Serviços e Insumos",null,null,"Unidade","Valor Unitário","Qtde","Valor Total"]
[null,null,null,null,null,null,null,{"$f":"G107*F107","v":0}]
[null,null,null,null,null,null,null,0]
[null,null,null,null,null,null,null,0]
[null,null,null,null,null,null,null,0]
[null,null,null,null,null,null,null,0]
[null,null,null,null,null,null,null,0]
[null,null,null,null,null,null,null,0]
[null,null,null,null,null,null,null,0]
[null,null,null,null,null,null,null,0]
[null,null,null,null,null,null,null,0]
[null,null,null,null,null,null,null,0]
[null,null,null,null,null,null,null,0]
[null,null,null,null,null,null,null,0]
[null,null,null,null,null,null,null,0]
[null,null,null,null,null,null,null,0]
[null,"Total Recursos por Reciprocidade",null,null,null,null,null,{"$f":"SUM(H107:H121)","v":0}]
[]
[null,null,null,null,null,null,"Origem","Origem"]
[null,null,null,null,null,null,"T","F"]

{"sheet":"SUB. 8","index":18,"n_rows":125,"n_cols":21,"rows_kept":125,"cut":false,"hidden":false,"merged":[[5,11,7,17],[39,1,39,7],[57,1,57,8],[83,1,83,8],[104,1,104,7],[79,4,79,6],[80,4,80,6],[81,4,81,6],[100,4,100,6],[101,4,101,6],[102,4,102,6],[100,1,100,3],[101,1,101,3],[102,1,102,3],[96,9,96,12],[98,1,98,3],[98,9,98,12],[99,1,99,3],[99,9,99,12],[100,9,102,12],[91,9,91,12],[93,1,93,3],[93,9,93,12],[94,1,94,3],[121,8,121,12],[118,1,118,3],[118,8,118,12],[119,1,119,3],[119,8,119,12],[120,1,120,3],[120,8,120,12],[121,1,121,3],[115,1,115,3],[115,8,115,12],[116,1,116,3],[116,8,116,12],[112,1,112,3],[110,8,110,12],[112,8,112,12],[113,1,113,3],[113,8,113,12],[114,1,114,3],[114,8,114,12],[105,1,105,3],[117,1,117,3],[117,8,117,12],[107,1,107,3],[107,8,107,12],[108,1,108,3],[108,8,108,12],[109,1,109,3],[109,8,109,12],[110,1,110,3],[111,1,111,3],[111,8,111,12],[104,8,105,12],[106,1,106,3],[106,8,106,12],[95,1,95,3],[95,9,95,12],[96,1,96,3],[87,1,87,3],[97,1,97,3],[97,9,97,12],[88,1,88,3],[88,9,88,12],[89,1,89,3],[89,9,89,12],[90,1,90,3],[90,9,90,12],[91,1,91,3],[79,9,81,12],[80,1,80,3],[81,1,81,3],[77,1,77,3],[77,9,77,12],[71,1,71,3],[79,1,79,3],[73,9,73,12],[94,9,94,12],[92,1,92,3],[92,9,92,12],[83,9,84,12],[84,1,84,3],[85,1,85,3],[85,9,85,12],[86,1,86,3],[86,9,86,12],[87,9,87,12],[67,1,67,3],[68,1,68,3],[78,1,78,3],[78,9,78,12],[70,9,70,12],[67,9,67,12],[64,1,64,3],[64,9,64,12],[65,1,65,3],[75,9,75,12],[76,1,76,3],[76,9,76,12],[69,1,69,3],[69,9,69,12],[70,1,70,3],[72,1,72,3],[72,9,72,12],[75,1,75,3],[73,1,73,3],[74,1,74,3],[74,9,74,12],[68,9,68,12],[71,9,71,12],[57,9,58,12],[58,1,58,3],[60,1,60,3],[42,8,42,12],[65,9,65,12],[66,1,66,3],[66,9,66,12],[45,1,45,3],[60,9,60,12],[61,1,61,3],[43,1,43,3],[44,1,44,3],[46,1,46,3],[47,1,47,3],[48,1,48,3],[51,1,51,3],[52,1,52,3],[53,1,53,3],[54,1,54,3],[49,1,49,3],[61,9,61,12],[50,1,50,3],[55,1,55,3],[56,1,56,3],[32,1,32,3],[62,1,62,3],[62,9,62,12],[63,1,63,3],[40,1,40,3],[32,20,32,21],[33,1,33,3],[33,20,33,21],[59,1,59,3],[47,8,47,12],[48,8,48,12],[55,8,55,12],[56,8,56,12],[52,8,52,12],[53,8,53,12],[51,8,51,12],[35,20,35,21],[36,1,36,3],[36,20,36,21],[38,1,38,12],[39,8,40,12],[41,8,41,12],[42,1,42,3],[59,9,59,12],[19,20,19,21],[20,1,20,3],[20,20,20,21],[22,20,22,21],[63,9,63,12],[34,1,34,3],[34,20,34,21],[35,1,35,3],[25,1,25,3],[41,1,41,3],[29,1,29,3],[29,20,29,21],[27,20,27,21],[28,20,28,21],[25,20,25,21],[30,20,30,21],[54,8,54,12],[43,8,43,12],[44,8,44,12],[45,8,45,12],[46,8,46,12],[30,1,30,3],[31,1,31,3],[31,20,31,21],[16,6,16,7],[22,1,22,3],[19,1,19,3],[11,2,11,10],[27,1,27,3],[28,1,28,3],[18,1,18,3],[21,1,21,3],[17,1,17,3],[26,1,26,3],[23,1,23,3],[24,1,24,3],[47,15,47,16],[48,15,48,16],[49,15,49,16],[1,1,1,21],[5,1,5,2],[12,11,13,17],[11,11,11,17],[49,8,49,12],[50,8,50,12],[21,20,21,21],[15,16,16,17],[15,20,17,21],[5,3,5,8],[18,20,18,21],[26,20,26,21],[16,10,16,11],[16,12,16,13],[15,1,16,5],[15,18,16,19],[15,6,15,15],[16,8,16,9],[23,20,23,21],[24,20,24,21],[16,14,16,15]]}
[]
[null,"ENTRADA DE DADOS POR SUBSISTEMA"]
[]
[]
[]
[null,"Subsistema n° 8:",null,null,null,null,null,null,null,null,"OBS"]
[]
[null,"ÁREA",null,"hectare(s)"]
[]
[]
[]
[null,null,"Horas Trabalhadas",null,null,null,null,null,null,null,null,"Observações"]
[null,null,"Mulher","Homem","Jovens Mulheres","Jovens Homens","Outras","Outros","Total Mulheres","Total Homens","TOTAL"]
[null,"N° Horas",null,null,null,null,null,null,{"$f":"C14+E14+G14","v":0},{"$f":"D14+F14+H14","v":0},{"$f":"C14+D14+E14+F14+G14+H14","v":0}]
[]
[null,"Produtos e Insumos Gerados",null,null,null,null,"Produtos",null,null,null,null,null,null,null,null,null,"Insumos Produzidos",null,"Total Produtos e Insumos",null,"Observações"]
[null,null,null,null,null,null,"Venda",null,"Autoconsumo",null,"Doações Trocas",null,"Estoque",null,"Total Produtos"]
[null,"Itens",null,null,"Unidade","Valor Unitário","Qtde","Valor Total","Qtde","Valor Total","Qtde","Valor Total","Qtde","Valor Total","Qtde","Valor Total","Qtde","Valor Total","Qtde","Valor Total"]
[null,null,null,null,null,null,0,{"$f":"G19*F19","v":0},0,{"$f":"I19*F19","v":0},0,{"$f":"K19*F19","v":0},0,{"$f":"M19*F19","v":0},{"$f":"G19+I19+K19+M19","v":0},{"$f":"F19*O19","v":0},null,{"$f":"Q19*F19","v":0},{"$f":"Q19+O19","v":0},{"$f":"S19*F19","v":0}]
[null,null,null,null,null,null,null,0,null,0,null,0,null,0,0,0,null,0,0,0]
[null,null,null,null,null,null,null,0,null,0,null,0,null,0,0,0,null,0,0,0]
[null,null,null,null,null,null,null,0,null,0,null,0,null,0,0,0,null,0,0,0]
[null,null,null,null,null,null,null,0,null,0,null,0,null,0,0,0,null,0,0,0]
[null,null,null,null,null,null,null,0,null,0,null,0,null,0,0,0,0,0,0,0]
[null,null,null,null,null,null,null,0,null,0,null,0,null,0,0,0,null,0,0,0]
[null,null,null,null,null,null,null,0,null,0,null,0,null,0,0,0,null,0,0,0]
[null,null,null,null,null,null,null,0,null,0,null,0,null,0,0,0,null,0,0,0]
[null,null,null,null,null,null,null,0,null,0,null,0,null,0,0,0,null,0,0,0]
[null,null,null,null,null,null,null,0,null,0,null,0,null,0,0,0,null,0,0,0]
[null,null,null,null,null,null,null,0,null,0,null,0,null,0,0,0,null,0,0,0]
[null,null,null,null,null,null,null,0,null,0,null,0,null,0,0,0,null,0,0,0]
[null,null,null,null,null,null,null,0,null,0,null,0,null,0,0,0,null,0,0,0]
[null,null,null,null,null,null,null,0,null,0,null,0,null,0,0,0,null,0,0,0]
[null,null,null,null,null,null,null,0,null,0,null,0,null,0,0,0,null,0,0,0]
[null,null,null,null,null,null,null,0,null,0,null,0,null,0,0,0,null,0,0,0]
[null,null,null,null,null,null,null,0,null,0,null,0,null,0,0,0,null,0,0,0]
[null,"Totais",null,null,null,null,null,{"$f":"SUM(H19:H36)","v":0},null,{"$f":"SUM(J19:J36)","v":0},null,{"$f":"SUM(L19:L36)","v":0},null,{"$f":"SUM(N19:N36)","v":0},null,{"$f":"SUM(P19:P36)","v":0},null,{"$f":"SUM(R19:R36)","v":0},null,{"$f":"SUM(T19:T36)","v":0}]
[]
[null,"Insumos"]
[null,"Produção Própria - Reciprocidade Ecológica",null,null,null,null,null,null,"Observações"]
[null,"Itens",null,null,"Unidade","Valor Unitário","Qtde","Valor Total"]
[null,null,null,null,null,null,null,{"$f":"G42*F42","v":0}]
[null,null,null,null,null,null,null,0]
[null,null,null,null,null,null,null,0]
[null,null,null,null,null,null,null,0]
[null,null,null,null,null,null,null,0]
[null,null,null,null,null,null,null,0]
[null,null,null,null,null,null,null,0]
[null,null,null,null,null,null,null,0]
[null,null,null,null,null,null,null,0]
[null,null,null,null,null,null,null,0]
[null,null,null,null,null,null,null,0]
[null,null,null,null,null,null,null,0]
[null,null,null,null,null,null,null,0]
[null,null,null,null,null,null,null,0]
[null,null,null,null,null,null,null,0]
[null,"Total Insumos -  Produção Própria",null,null,null,null,null,{"$f":"SUM(H42:H56)","v":0}]
[null,"Comprados - Consumos Intermediários ",null,null,null,null,null,null,null,"Observações"]
[null,"Insumos",null,null,"Unidade","Valor Unitário","Qtde","Valor Total","Origem"]
[null,null,null,null,null,null,null,{"$f":"G60*F60","v":0}]
[null,null,null,null,null,null,null,{"$f":"G61*F61","v":0}]
[null,null,null,null,null,null,null,0]
[null,null,null,null,null,null,null,0]
[null,null,null,null,null,null,null,0]
[null,null,null,null,null,null,null,0]
[null,null,null,null,null,null,null,0]
[null,null,null,null,null,null,null,0]
[null,null,null,null,null,null,null,0]
[null,null,null,null,null,null,null,0]
[null,null,null,null,null,null,null,0]
[null,null,null,null,null,null,null,0]
[null,null,null,null,null,null,null,0]
[null,null,null,null,null,null,null,0]
[null,null,null,null,null,null,null,0]
[null,null,null,null,null,null,null,0]
[null,null,null,null,null,null,null,0]
[null,null,null,null,null,null,null,0]
[null,null,null,null,null,null,null,0]
[null,null,null,null,null,null,null,0]
[null," Insumos Comprados no Território",null,null,null,null,null,{"$f":"DSUM(H59:I79,\"Valor Total\",G124:G125)","v":0}]
[null," Insumos Comprados Fora do Território",null,null,null,null,null,{"$f":"DSUM(H59:I79,\"Valor Total\",H124:H125)","v":0}]
[null,"Total de Insumos Comprados",null,null,null,null,null,{"$f":"SUM(H60:H79)","v":0}]
[]
[null,"Pagamento a Terceiros",null,null,null,null,null,null,null,"Observações"]
[null,"Serviços/Renda da Terra",null,null,"Unidade","Valor Unitário","Qtde","Valor Total","Origem"]
[null,null,null,null,null,null,null,{"$f":"G86*F86","v":0}]
[null,null,null,null,null,null,null,0]
[null,null,null,null,null,null,null,0]
[null,null,null,null,null,null,null,0]
[null,null,null,null,null,null,null,0]
[null,null,null,null,null,null,null,0]
[null,null,null,null,null,null,null,0]
[null,null,null,null,null,null,null,0]
[null,null,null,null,null,null,null,0]
[null,null,null,null,null,null,null,0]
[null,null,null,null,null,null,null,0]
[null,null,null,null,null,null,null,0]
[null,null,null,null,null,null,null,0]
[null,null,null,null,null,null,null,0]
[null,null,null,null,null,null,null,0]
[null,"Pagamentos a Terceiros do Território",null,null,null,null,null,{"$f":"DSUM(H85:I100,\"Valor Total\",G124:G125)","v":0}]
[null,"Pagamentos a Terceiros Fora do Território",null,null,null,null,null,{"$f":"DSUM(H85:I100,\"Valor Total\",H124:H125)","v":0}]
[null,"Total de Pagamentos a Terceiros ",null,null,null,null,null,{"$f":"SUM(H86:H100)","v":0}]
[]
[null,"Entrada de Recursos  por Reciprocidade",null,null,null,null,null,null,"Observações"]
[null,"Serviços e Insumos",null,null,"Unidade","Valor Unitário","Qtde","Valor Total"]
[null,null,null,null,null,null,null,{"$f":"G107*F107","v":0}]
[null,null,null,null,null,null,null,0]
[null,null,null,null,null,null,null,0]
[null,null,null,null,null,null,null,0]
[null,null,null,null,null,null,null,0]
[null,null,null,null,null,null,null,0]
[null,null,null,null,null,null,null,0]
[null,null,null,null,null,null,null,0]
[null,null,null,null,null,null,null,0]
[null,null,null,null,null,null,null,0]
[null,null,null,null,null,null,null,0]
[null,null,null,null,null,null,null,0]
[null,null,null,null,null,null,null,0]
[null,null,null,null,null,null,null,0]
[null,null,null,null,null,null,null,0]
[null,"Total Recursos por Reciprocidade",null,null,null,null,null,{"$f":"SUM(H107:H121)","v":0}]
[]
[null,null,null,null,null,null,"Origem","Origem"]
[null,null,null,null,null,null,"T","F"]

{"sheet":"SUB. 9","index":19,"n_rows":125,"n_cols":21,"rows_kept":125,"cut":false,"hidden":false,"merged":[[46,1,46,3],[47,1,47,3],[48,1,48,3],[51,1,51,3],[52,1,52,3],[53,1,53,3],[54,1,54,3],[56,1,56,3],[50,1,50,3],[121,1,121,3],[121,8,121,12],[118,1,118,3],[118,8,118,12],[119,1,119,3],[119,8,119,12],[114,1,114,3],[114,8,114,12],[120,1,120,3],[120,8,120,12],[115,1,115,3],[115,8,115,12],[116,1,116,3],[117,1,117,3],[117,8,117,12],[112,8,112,12],[113,1,113,3],[113,8,113,12],[112,1,112,3],[100,9,102,12],[104,8,105,12],[116,8,116,12],[107,1,107,3],[107,8,107,12],[108,1,108,3],[108,8,108,12],[109,1,109,3],[110,8,110,12],[111,1,111,3],[111,8,111,12],[104,1,104,7],[100,4,100,6],[101,4,101,6],[102,4,102,6],[102,1,102,3],[101,1,101,3],[100,1,100,3],[98,9,98,12],[99,1,99,3],[99,9,99,12],[109,8,109,12],[110,1,110,3],[105,1,105,3],[106,1,106,3],[106,8,106,12],[93,1,93,3],[93,9,93,12],[94,1,94,3],[94,9,94,12],[95,9,95,12],[96,1,96,3],[95,1,95,3],[98,1,98,3],[96,9,96,12],[97,1,97,3],[97,9,97,12],[88,1,88,3],[88,9,88,12],[89,1,89,3],[89,9,89,12],[90,9,90,12],[91,1,91,3],[90,1,90,3],[92,1,92,3],[92,9,92,12],[83,9,84,12],[84,1,84,3],[85,1,85,3],[78,1,78,3],[87,1,87,3],[87,9,87,12],[78,9,78,12],[79,1,79,3],[79,9,81,12],[80,1,80,3],[81,1,81,3],[85,9,85,12],[86,1,86,3],[86,9,86,12],[83,1,83,8],[79,4,79,6],[80,4,80,6],[81,4,81,6],[63,1,63,3],[63,9,63,12],[57,9,58,12],[58,1,58,3],[57,1,57,8],[48,8,48,12],[77,9,77,12],[71,1,71,3],[91,9,91,12],[74,1,74,3],[74,9,74,12],[75,1,75,3],[75,9,75,12],[76,1,76,3],[76,9,76,12],[71,9,71,12],[72,1,72,3],[77,1,77,3],[73,1,73,3],[73,9,73,12],[64,1,64,3],[64,9,64,12],[65,1,65,3],[65,9,65,12],[66,1,66,3],[66,9,66,12],[67,1,67,3],[67,9,67,12],[68,1,68,3],[68,9,68,12],[70,9,70,12],[69,1,69,3],[69,9,69,12],[70,1,70,3],[36,1,36,3],[36,20,36,21],[38,1,38,12],[39,8,40,12],[40,1,40,3],[44,8,44,12],[45,8,45,12],[39,1,39,7],[72,9,72,12],[41,1,41,3],[42,1,42,3],[43,1,43,3],[44,1,44,3],[45,1,45,3],[55,1,55,3],[49,1,49,3],[59,1,59,3],[59,9,59,12],[60,1,60,3],[60,9,60,12],[61,1,61,3],[61,9,61,12],[62,1,62,3],[62,9,62,12],[31,1,31,3],[31,20,31,21],[32,1,32,3],[32,20,32,21],[33,1,33,3],[33,20,33,21],[34,1,34,3],[35,1,35,3],[35,20,35,21],[26,1,26,3],[27,1,27,3],[28,1,28,3],[27,20,27,21],[28,20,28,21],[29,1,29,3],[29,20,29,21],[30,1,30,3],[30,20,30,21],[23,1,23,3],[23,20,23,21],[24,1,24,3],[24,20,24,21],[21,1,21,3],[22,1,22,3],[22,20,22,21],[25,1,25,3],[25,20,25,21],[1,1,1,21],[5,1,5,2],[26,20,26,21],[34,20,34,21],[15,1,16,5],[15,18,16,19],[15,6,15,15],[21,20,21,21],[18,1,18,3],[18,20,18,21],[19,1,19,3],[19,20,19,21],[20,1,20,3],[5,3,5,8],[11,2,11,10],[16,14,16,15],[16,6,16,7],[16,8,16,9],[16,10,16,11],[5,11,7,17],[15,16,16,17],[15,20,17,21],[17,1,17,3],[20,20,20,21],[56,8,56,12],[12,11,13,17],[11,11,11,17],[49,8,49,12],[50,8,50,12],[51,8,51,12],[52,8,52,12],[53,8,53,12],[46,8,46,12],[47,8,47,12],[16,12,16,13],[41,8,41,12],[42,8,42,12],[54,8,54,12],[43,8,43,12],[55,8,55,12]]}
[]
[null,"ENTRADA DE DADOS POR SUBSISTEMA"]
[]
[]
[]
[null,"Subsistema n° 9:",null,null,null,null,null,null,null,null,"OBS"]
[]
[null,"ÁREA",null,"hectare(s)"]
[]
[]
[]
[null,null,"Horas Trabalhadas",null,null,null,null,null,null,null,null,"Observações"]
[null,null,"Mulher","Homem","Jovens Mulheres","Jovens Homens","Outras","Outros","Total Mulheres","Total Homens","TOTAL"]
[null,"N° Horas",null,null,null,null,null,null,{"$f":"C14+E14+G14","v":0},{"$f":"D14+F14+H14","v":0},{"$f":"C14+D14+E14+F14+G14+H14","v":0}]
[]
[null,"Produtos e Insumos Gerados",null,null,null,null,"Produtos",null,null,null,null,null,null,null,null,null,"Insumos Produzidos",null,"Total Produtos e Insumos",null,"Observações"]
[null,null,null,null,null,null,"Venda",null,"Autoconsumo",null,"Doações Trocas",null,"Estoque",null,"Total Produtos"]
[null,"Itens",null,null,"Unidade","Valor Unitário","Qtde","Valor Total","Qtde","Valor Total","Qtde","Valor Total","Qtde","Valor Total","Qtde","Valor Total","Qtde","Valor Total","Qtde","Valor Total"]
[null,null,null,null,null,null,0,{"$f":"G19*F19","v":0},0,{"$f":"I19*F19","v":0},0,{"$f":"K19*F19","v":0},0,{"$f":"M19*F19","v":0},{"$f":"G19+I19+K19+M19","v":0},{"$f":"F19*O19","v":0},0,{"$f":"Q19*F19","v":0},{"$f":"Q19+O19","v":0},{"$f":"S19*F19","v":0}]
[null,null,null,null,null,null,null,0,null,0,null,0,null,0,0,0,null,0,0,0]
[null,null,null,null,null,null,null,0,null,0,null,0,null,0,0,0,null,0,0,0]
[null,null,null,null,null,null,null,0,null,0,null,0,null,0,0,0,null,0,0,0]
[null,null,null,null,null,null,null,0,null,0,null,0,null,0,0,0,null,0,0,0]
[null,null,null,null,null,null,null,0,null,0,null,0,null,0,0,0,null,0,0,0]
[null,null,null,null,null,null,null,0,null,0,null,0,null,0,0,0,null,0,0,0]
[null,null,null,null,null,null,null,0,null,0,null,0,null,0,0,0,null,0,0,0]
[null,null,null,null,null,null,null,0,null,0,null,0,null,0,0,0,null,0,0,0]
[null,null,null,null,null,null,null,0,null,0,null,0,null,0,0,0,null,0,0,0]
[null,null,null,null,null,null,null,0,null,0,null,0,null,0,0,0,null,0,0,0]
[null,null,null,null,null,null,null,0,null,0,null,0,null,0,0,0,null,0,0,0]
[null,null,null,null,null,null,null,0,null,0,null,0,null,0,0,0,null,0,0,0]
[null,null,null,null,null,null,null,0,null,0,null,0,null,0,0,0,null,0,0,0]
[null,null,null,null,null,null,null,0,null,0,null,0,null,0,0,0,null,0,0,0]
[null,null,null,null,null,null,null,0,null,0,null,0,null,0,0,0,null,0,0,0]
[null,null,null,null,null,null,null,0,null,0,null,0,null,0,0,0,null,0,0,0]
[null,null,null,null,null,null,null,0,null,0,null,0,null,0,0,0,null,0,0,0]
[null,"Totais",null,null,null,null,null,{"$f":"SUM(H19:H36)","v":0},null,{"$f":"SUM(J19:J36)","v":0},null,{"$f":"SUM(L19:L36)","v":0},null,{"$f":"SUM(N19:N36)","v":0},null,{"$f":"SUM(P19:P36)","v":0},null,{"$f":"SUM(R19:R36)","v":0},null,{"$f":"SUM(T19:T36)","v":0}]
[]
[null,"Insumos"]
[null,"Produção Própria - Reciprocidade Ecológica",null,null,null,null,null,null,"Observações"]
[null,"Itens",null,null,"Unidade","Valor Unitário","Qtde","Valor Total"]
[null,null,null,null,null,null,null,{"$f":"G42*F42","v":0}]
[null,null,null,null,null,null,null,0]
[null,null,null,null,null,null,null,0]
[null,null,null,null,null,null,null,0]
[null,null,null,null,null,null,null,0]
[null,null,null,null,null,null,null,0]
[null,null,null,null,null,null,null,0]
[null,null,null,null,null,null,null,0]
[null,null,null,null,null,null,null,0]
[null,null,null,null,null,null,null,0]
[null,null,null,null,null,null,null,0]
[null,null,null,null,null,null,null,0]
[null,null,null,null,null,null,null,0]
[null,null,null,null,null,null,null,0]
[null,null,null,null,null,null,null,0]
[null,"Total Insumos -  Produção Própria",null,null,null,null,null,{"$f":"SUM(H42:H56)","v":0}]
[null,"Comprados - Consumos Intermediários ",null,null,null,null,null,null,null,"Observações"]
[null,"Insumos",null,null,"Unidade","Valor Unitário","Qtde","Valor Total","Origem"]
[null,null,null,null,null,null,null,{"$f":"G60*F60","v":0}]
[null,null,null,null,null,null,null,{"$f":"G61*F61","v":0}]
[null,null,null,null,null,null,null,0]
[null,null,null,null,null,null,null,0]
[null,null,null,null,null,null,null,0]
[null,null,null,null,null,null,null,0]
[null,null,null,null,null,null,null,0]
[null,null,null,null,null,null,null,0]
[null,null,null,null,null,null,null,0]
[null,null,null,null,null,null,null,0]
[null,null,null,null,null,null,null,0]
[null,null,null,null,null,null,null,0]
[null,null,null,null,null,null,null,0]
[null,null,null,null,null,null,null,0]
[null,null,null,null,null,null,null,0]
[null,null,null,null,null,null,null,0]
[null,null,null,null,null,null,null,0]
[null,null,null,null,null,null,null,0]
[null,null,null,null,null,null,null,0]
[null,null,null,null,null,null,null,0]
[null," Insumos Comprados no Território",null,null,null,null,null,{"$f":"DSUM(H59:I79,\"Valor Total\",G124:G125)","v":0}]
[null," Insumos Comprados Fora do Território",null,null,null,null,null,{"$f":"DSUM(H59:I79,\"Valor Total\",H124:H125)","v":0}]
[null,"Total de Insumos Comprados",null,null,null,null,null,{"$f":"SUM(H60:H79)","v":0}]
[]
[null,"Pagamento a Terceiros",null,null,null,null,null,null,null,"Observações"]
[null,"Serviços/Renda da Terra",null,null,"Unidade","Valor Unitário","Qtde","Valor Total","Origem"]
[null,null,null,null,null,null,null,{"$f":"G86*F86","v":0}]
[null,null,null,null,null,null,null,0]
[null,null,null,null,null,null,null,0]
[null,null,null,null,null,null,null,0]
[null,null,null,null,null,null,null,0]
[null,null,null,null,null,null,null,0]
[null,null,null,null,null,null,null,0]
[null,null,null,null,null,null,null,0]
[null,null,null,null,null,null,null,0]
[null,null,null,null,null,null,null,0]
[null,null,null,null,null,null,null,0]
[null,null,null,null,null,null,null,0]
[null,null,null,null,null,null,null,0]
[null,null,null,null,null,null,null,0]
[null,null,null,null,null,null,null,0]
[null,"Pagamentos a Terceiros do Território",null,null,null,null,null,{"$f":"DSUM(H85:I100,\"Valor Total\",G124:G125)","v":0}]
[null,"Pagamentos a Terceiros Fora do Território",null,null,null,null,null,{"$f":"DSUM(H85:I100,\"Valor Total\",H124:H125)","v":0}]
[null,"Total de Pagamentos a Terceiros ",null,null,null,null,null,{"$f":"SUM(H86:H100)","v":0}]
[]
[null,"Entrada de Recursos  por Reciprocidade",null,null,null,null,null,null,"Observações"]
[null,"Serviços e Insumos",null,null,"Unidade","Valor Unitário","Qtde","Valor Total"]
[null,null,null,null,null,null,null,{"$f":"G107*F107","v":0}]
[null,null,null,null,null,null,null,0]
[null,null,null,null,null,null,null,0]
[null,null,null,null,null,null,null,0]
[null,null,null,null,null,null,null,0]
[null,null,null,null,null,null,null,0]
[null,null,null,null,null,null,null,0]
[null,null,null,null,null,null,null,0]
[null,null,null,null,null,null,null,0]
[null,null,null,null,null,null,null,0]
[null,null,null,null,null,null,null,0]
[null,null,null,null,null,null,null,0]
[null,null,null,null,null,null,null,0]
[null,null,null,null,null,null,null,0]
[null,null,null,null,null,null,null,0]
[null,"Total Recursos por Reciprocidade",null,null,null,null,null,{"$f":"SUM(H107:H121)","v":0}]
[]
[null,null,null,null,null,null,"Origem","Origem"]
[null,null,null,null,null,null,"T","F"]

{"sheet":"SUB. 10","index":20,"n_rows":125,"n_cols":21,"rows_kept":125,"cut":false,"hidden":false,"merged":[[5,11,7,17],[15,16,16,17],[39,8,40,12],[39,1,39,7],[57,1,57,8],[83,1,83,8],[77,1,77,3],[77,9,77,12],[71,1,71,3],[83,9,84,12],[84,1,84,3],[46,1,46,3],[47,1,47,3],[45,1,45,3],[64,1,64,3],[68,1,68,3],[52,1,52,3],[55,1,55,3],[49,1,49,3],[59,1,59,3],[48,1,48,3],[36,1,36,3],[30,1,30,3],[25,1,25,3],[112,1,112,3],[104,8,105,12],[107,1,107,3],[107,8,107,12],[108,1,108,3],[108,8,108,12],[114,1,114,3],[51,1,51,3],[90,1,90,3],[90,9,90,12],[85,9,85,12],[86,1,86,3],[86,9,86,12],[88,1,88,3],[88,9,88,12],[89,1,89,3],[89,9,89,12],[85,1,85,3],[114,8,114,12],[95,9,95,12],[96,1,96,3],[110,8,110,12],[111,1,111,3],[111,8,111,12],[120,1,120,3],[120,8,120,12],[115,1,115,3],[115,8,115,12],[116,1,116,3],[121,1,121,3],[121,8,121,12],[118,1,118,3],[118,8,118,12],[119,1,119,3],[116,8,116,12],[117,1,117,3],[117,8,117,12],[119,8,119,12],[98,9,98,12],[99,1,99,3],[99,9,99,12],[100,9,102,12],[104,1,104,7],[100,4,100,6],[100,1,100,3],[101,1,101,3],[102,1,102,3],[95,1,95,3],[101,4,101,6],[109,1,109,3],[109,8,109,12],[110,1,110,3],[112,8,112,12],[113,1,113,3],[113,8,113,12],[91,1,91,3],[105,1,105,3],[106,1,106,3],[106,8,106,12],[93,1,93,3],[93,9,93,12],[94,1,94,3],[94,9,94,12],[91,9,91,12],[96,9,96,12],[97,1,97,3],[97,9,97,12],[92,1,92,3],[92,9,92,12],[102,4,102,6],[98,1,98,3],[54,1,54,3],[56,1,56,3],[78,1,78,3],[78,9,78,12],[70,9,70,12],[69,9,69,12],[70,1,70,3],[76,1,76,3],[79,1,79,3],[79,9,81,12],[80,1,80,3],[81,1,81,3],[74,1,74,3],[74,9,74,12],[75,1,75,3],[75,9,75,12],[76,9,76,12],[71,9,71,12],[72,1,72,3],[79,4,79,6],[80,4,80,6],[81,4,81,6],[87,1,87,3],[50,1,50,3],[72,9,72,12],[73,1,73,3],[73,9,73,12],[64,9,64,12],[65,1,65,3],[65,9,65,12],[66,1,66,3],[66,9,66,12],[67,1,67,3],[67,9,67,12],[68,9,68,12],[69,1,69,3],[59,9,59,12],[60,1,60,3],[60,9,60,12],[61,1,61,3],[61,9,61,12],[62,1,62,3],[62,9,62,12],[63,1,63,3],[63,9,63,12],[87,9,87,12],[36,20,36,21],[57,9,58,12],[58,1,58,3],[38,1,38,12],[52,8,52,12],[40,1,40,3],[44,8,44,12],[45,8,45,12],[51,8,51,12],[41,8,41,12],[42,8,42,12],[43,8,43,12],[53,8,53,12],[54,8,54,12],[55,8,55,12],[56,8,56,12],[46,8,46,12],[47,8,47,12],[48,8,48,12],[41,1,41,3],[42,1,42,3],[43,1,43,3],[44,1,44,3],[53,1,53,3],[30,20,30,21],[31,1,31,3],[31,20,31,21],[32,1,32,3],[32,20,32,21],[33,1,33,3],[33,20,33,21],[35,20,35,21],[34,1,34,3],[35,1,35,3],[29,1,29,3],[29,20,29,21],[15,6,15,15],[21,20,21,21],[15,20,17,21],[17,1,17,3],[20,20,20,21],[21,1,21,3],[23,1,23,3],[23,20,23,21],[24,1,24,3],[24,20,24,21],[16,10,16,11],[16,12,16,13],[15,18,16,19],[25,20,25,21],[26,1,26,3],[27,1,27,3],[28,1,28,3],[27,20,27,21],[28,20,28,21],[47,15,47,16],[48,15,48,16],[49,15,49,16],[1,1,1,21],[5,1,5,2],[49,8,49,12],[50,8,50,12],[16,14,16,15],[16,6,16,7],[16,8,16,9],[26,20,26,21],[34,20,34,21],[15,1,16,5],[18,1,18,3],[18,20,18,21],[19,1,19,3],[19,20,19,21],[20,1,20,3],[22,1,22,3],[22,20,22,21],[5,3,5,8],[11,2,11,10],[11,11,11,17],[12,11,13,17]]}
[]
["sel17","ENTRADA DE DADOS POR SUBSISTEMA"]
[]
[]
[]
[null,"Subsistema n° 10:",null,null,null,null,null,null,null,null,"OBS"]
[]
[null,"ÁREA",null,"hectare(s)"]
[]
[]
[]
[null,null,"Horas Trabalhadas",null,null,null,null,null,null,null,null,"Observações"]
[null,null,"Mulher","Homem","Jovens Mulheres","Jovens Homens","Outras","Outros","Total Mulheres","Total Homens","TOTAL"]
[null,"N° Horas",null,null,null,null,null,null,{"$f":"C14+E14+G14","v":0},{"$f":"D14+F14+H14","v":0},{"$f":"C14+D14+E14+F14+G14+H14","v":0}]
[]
[null,"Produtos e Insumos Gerados",null,null,null,null,"Produtos",null,null,null,null,null,null,null,null,null,"Insumos Produzidos",null,"Total Produtos e Insumos",null,"Observações"]
[null,null,null,null,null,null,"Venda",null,"Autoconsumo",null,"Doações Trocas",null,"Estoque",null,"Total Produtos"]
[null,"Itens",null,null,"Unidade","Valor Unitário","Qtde","Valor Total","Qtde","Valor Total","Qtde","Valor Total","Qtde","Valor Total","Qtde","Valor Total","Qtde","Valor Total","Qtde","Valor Total"]
[null,null,null,null,null,null,0,{"$f":"G19*F19","v":0},0,{"$f":"I19*F19","v":0},0,{"$f":"K19*F19","v":0},0,{"$f":"M19*F19","v":0},{"$f":"G19+I19+K19+M19","v":0},{"$f":"F19*O19","v":0},0,{"$f":"Q19*F19","v":0},{"$f":"Q19+O19","v":0},{"$f":"S19*F19","v":0}]
[null,null,null,null,null,null,null,0,null,0,null,0,null,0,0,0,null,0,0,0]
[null,null,null,null,null,null,null,0,null,0,null,0,null,0,0,0,null,0,0,0]
[null,null,null,null,null,null,null,0,null,0,null,0,null,0,0,0,null,0,0,0]
[null,null,null,null,null,null,null,0,null,0,null,0,null,0,0,0,null,0,0,0]
[null,null,null,null,null,null,null,0,null,0,null,0,null,0,0,0,null,0,0,0]
[null,null,null,null,null,null,null,0,null,0,null,0,null,0,0,0,null,0,0,0]
[null,null,null,null,null,null,null,0,null,0,null,0,null,0,0,0,null,0,0,0]
[null,null,null,null,null,null,null,0,null,0,null,0,null,0,0,0,null,0,0,0]
[null,null,null,null,null,null,null,0,null,0,null,0,null,0,0,0,null,0,0,0]
[null,null,null,null,null,null,null,0,null,0,null,0,null,0,0,0,null,0,0,0]
[null,null,null,null,null,null,null,0,null,0,null,0,null,0,0,0,null,0,0,0]
[null,null,null,null,null,null,null,0,null,0,null,0,null,0,0,0,null,0,0,0]
[null,null,null,null,null,null,null,0,null,0,null,0,null,0,0,0,null,0,0,0]
[null,null,null,null,null,null,null,0,null,0,null,0,null,0,0,0,null,0,0,0]
[null,null,null,null,null,null,null,0,null,0,null,0,null,0,0,0,null,0,0,0]
[null,null,null,null,null,null,null,0,null,0,null,0,null,0,0,0,null,0,0,0]
[null,null,null,null,null,null,null,0,null,0,null,0,null,0,0,0,null,0,0,0]
[null,"Totais",null,null,null,null,null,{"$f":"SUM(H19:H36)","v":0},null,{"$f":"SUM(J19:J36)","v":0},null,{"$f":"SUM(L19:L36)","v":0},null,{"$f":"SUM(N19:N36)","v":0},null,{"$f":"SUM(P19:P36)","v":0},null,{"$f":"SUM(R19:R36)","v":0},null,{"$f":"SUM(T19:T36)","v":0}]
[]
[null,"Insumos"]
[null,"Produção Própria - Reciprocidade Ecológica",null,null,null,null,null,null,"Observações"]
[null,"Itens",null,null,"Unidade","Valor Unitário","Qtde","Valor Total"]
[null,null,null,null,null,null,null,{"$f":"G42*F42","v":0}]
[null,null,null,null,null,null,null,0]
[null,null,null,null,null,null,null,0]
[null,null,null,null,null,null,null,0]
[null,null,null,null,null,null,null,0]
[null,null,null,null,null,null,null,0]
[null,null,null,null,null,null,null,0]
[null,null,null,null,null,null,null,0]
[null,null,null,null,null,null,null,0]
[null,null,null,null,null,null,null,0]
[null,null,null,null,null,null,null,0]
[null,null,null,null,null,null,null,0]
[null,null,null,null,null,null,null,0]
[null,null,null,null,null,null,null,0]
[null,null,null,null,null,null,null,0]
[null,"Total Insumos -  Produção Própria",null,null,null,null,null,{"$f":"SUM(H42:H56)","v":0}]
[null,"Comprados - Consumos Intermediários ",null,null,null,null,null,null,null,"Observações"]
[null,"Insumos",null,null,"Unidade","Valor Unitário","Qtde","Valor Total","Origem"]
[null,null,null,null,null,null,null,{"$f":"G60*F60","v":0}]
[null,null,null,null,null,null,null,{"$f":"G61*F61","v":0}]
[null,null,null,null,null,null,null,0]
[null,null,null,null,null,null,null,0]
[null,null,null,null,null,null,null,0]
[null,null,null,null,null,null,null,0]
[null,null,null,null,null,null,null,0]
[null,null,null,null,null,null,null,0]
[null,null,null,null,null,null,null,0]
[null,null,null,null,null,null,null,0]
[null,null,null,null,null,null,null,0]
[null,null,null,null,null,null,null,0]
[null,null,null,null,null,null,null,0]
[null,null,null,null,null,null,null,0]
[null,null,null,null,null,null,null,0]
[null,null,null,null,null,null,null,0]
[null,null,null,null,null,null,null,0]
[null,null,null,null,null,null,null,0]
[null,null,null,null,null,null,null,0]
[null,null,null,null,null,null,null,0]
[null," Insumos Comprados no Território",null,null,null,null,null,{"$f":"DSUM(H59:I79,\"Valor Total\",G124:G125)","v":0}]
[null," Insumos Comprados Fora do Território",null,null,null,null,null,{"$f":"DSUM(H59:I79,\"Valor Total\",H124:H125)","v":0}]
[null,"Total de Insumos Comprados",null,null,null,null,null,{"$f":"SUM(H60:H79)","v":0}]
[]
[null,"Pagamento a Terceiros",null,null,null,null,null,null,null,"Observações"]
[null,"Serviços/Renda da Terra",null,null,"Unidade","Valor Unitário","Qtde","Valor Total","Origem"]
[null,null,null,null,null,null,null,{"$f":"G86*F86","v":0}]
[null,null,null,null,null,null,null,0]
[null,null,null,null,null,null,null,0]
[null,null,null,null,null,null,null,0]
[null,null,null,null,null,null,null,0]
[null,null,null,null,null,null,null,0]
[null,null,null,null,null,null,null,0]
[null,null,null,null,null,null,null,0]
[null,null,null,null,null,null,null,0]
[null,null,null,null,null,null,null,0]
[null,null,null,null,null,null,null,0]
[null,null,null,null,null,null,null,0]
[null,null,null,null,null,null,null,0]
[null,null,null,null,null,null,null,0]
[null,null,null,null,null,null,null,0]
[null,"Pagamentos a Terceiros do Território",null,null,null,null,null,{"$f":"DSUM(H85:I100,\"Valor Total\",G124:G125)","v":0}]
[null,"Pagamentos a Terceiros Fora do Território",null,null,null,null,null,{"$f":"DSUM(H85:I100,\"Valor Total\",H124:H125)","v":0}]
[null,"Total de Pagamentos a Terceiros ",null,null,null,null,null,{"$f":"SUM(H86:H100)","v":0}]
[]
[null,"Entrada de Recursos  por Reciprocidade",null,null,null,null,null,null,"Observações"]
[null,"Serviços e Insumos",null,null,"Unidade","Valor Unitário","Qtde","Valor Total"]
[null,null,null,null,null,null,null,{"$f":"G107*F107","v":0}]
[null,null,null,null,null,null,null,0]
[null,null,null,null,null,null,null,0]
[null,null,null,null,null,null,null,0]
[null,null,null,null,null,null,null,0]
[null,null,null,null,null,null,null,0]
[null,null,null,null,null,null,null,0]
[null,null,null,null,null,null,null,0]
[null,null,null,null,null,null,null,0]
[null,null,null,null,null,null,null,0]
[null,null,null,null,null,null,null,0]
[null,null,null,null,null,null,null,0]
[null,null,null,null,null,null,null,0]
[null,null,null,null,null,null,null,0]
[null,null,null,null,null,null,null,0]
[null,"Total Recursos por Reciprocidade",null,null,null,null,null,{"$f":"SUM(H107:H121)","v":0}]
[]
[null,null,null,null,null,null,"Origem","Origem"]
[null,null,null,null,null,null,"T","F"]

{"sheet":"SUB. 11","index":21,"n_rows":125,"n_cols":21,"rows_kept":125,"cut":false,"hidden":false,"merged":[[102,4,102,6],[105,1,105,3],[88,1,88,3],[88,9,88,12],[89,1,89,3],[121,1,121,3],[121,8,121,12],[118,1,118,3],[118,8,118,12],[119,1,119,3],[119,8,119,12],[112,1,112,3],[112,8,112,12],[113,1,113,3],[113,8,113,12],[114,1,114,3],[114,8,114,12],[120,1,120,3],[120,8,120,12],[115,1,115,3],[115,8,115,12],[116,1,116,3],[116,8,116,12],[117,1,117,3],[117,8,117,12],[107,1,107,3],[107,8,107,12],[108,1,108,3],[108,8,108,12],[109,1,109,3],[109,8,109,12],[110,1,110,3],[110,8,110,12],[111,1,111,3],[111,8,111,12],[106,1,106,3],[106,8,106,12],[93,1,93,3],[93,9,93,12],[94,1,94,3],[94,9,94,12],[95,1,95,3],[95,9,95,12],[96,1,96,3],[96,9,96,12],[97,1,97,3],[97,9,97,12],[104,1,104,7],[100,4,100,6],[101,4,101,6],[100,1,100,3],[101,1,101,3],[102,1,102,3],[98,1,98,3],[98,9,98,12],[99,1,99,3],[99,9,99,12],[100,9,102,12],[104,8,105,12],[92,1,92,3],[92,9,92,12],[83,9,84,12],[84,1,84,3],[85,1,85,3],[85,9,85,12],[86,1,86,3],[86,9,86,12],[87,1,87,3],[87,9,87,12],[83,1,83,8],[73,1,73,3],[73,9,73,12],[66,1,66,3],[66,9,66,12],[67,1,67,3],[89,9,89,12],[90,1,90,3],[90,9,90,12],[91,1,91,3],[91,9,91,12],[79,4,79,6],[80,4,80,6],[81,4,81,6],[77,1,77,3],[77,9,77,12],[75,9,75,12],[79,1,79,3],[76,9,76,12],[79,9,81,12],[80,1,80,3],[81,1,81,3],[74,1,74,3],[74,9,74,12],[75,1,75,3],[76,1,76,3],[78,1,78,3],[78,9,78,12],[72,9,72,12],[55,1,55,3],[49,1,49,3],[67,9,67,12],[69,1,69,3],[69,9,69,12],[70,1,70,3],[70,9,70,12],[71,1,71,3],[71,9,71,12],[72,1,72,3],[62,9,62,12],[64,1,64,3],[64,9,64,12],[65,1,65,3],[65,9,65,12],[51,1,51,3],[52,1,52,3],[53,1,53,3],[54,1,54,3],[56,1,56,3],[68,1,68,3],[68,9,68,12],[59,1,59,3],[59,9,59,12],[60,1,60,3],[60,9,60,12],[61,1,61,3],[61,9,61,12],[62,1,62,3],[63,1,63,3],[63,9,63,12],[46,1,46,3],[47,1,47,3],[48,1,48,3],[57,9,58,12],[58,1,58,3],[30,1,30,3],[33,1,33,3],[39,1,39,7],[34,1,34,3],[35,1,35,3],[57,1,57,8],[53,8,53,12],[54,8,54,12],[52,8,52,12],[50,8,50,12],[51,8,51,12],[49,8,49,12],[50,1,50,3],[41,1,41,3],[23,1,23,3],[23,20,23,21],[24,1,24,3],[24,20,24,21],[25,1,25,3],[25,20,25,21],[29,1,29,3],[29,20,29,21],[27,1,27,3],[33,20,33,21],[32,1,32,3],[43,8,43,12],[44,8,44,12],[45,8,45,12],[28,1,28,3],[26,20,26,21],[27,20,27,21],[28,20,28,21],[31,20,31,21],[35,20,35,21],[36,1,36,3],[36,20,36,21],[32,20,32,21],[40,1,40,3],[45,1,45,3],[30,20,30,21],[31,1,31,3],[26,1,26,3],[42,1,42,3],[43,1,43,3],[44,1,44,3],[34,20,34,21],[15,6,15,15],[21,20,21,21],[22,1,22,3],[22,20,22,21],[16,12,16,13],[15,1,16,5],[15,18,16,19],[15,16,16,17],[18,1,18,3],[15,20,17,21],[18,20,18,21],[19,1,19,3],[19,20,19,21],[20,1,20,3],[20,20,20,21],[21,1,21,3],[47,15,47,16],[48,15,48,16],[49,15,49,16],[1,1,1,21],[5,1,5,2],[55,8,55,12],[11,11,11,17],[12,11,13,17],[56,8,56,12],[38,1,38,12],[39,8,40,12],[41,8,41,12],[42,8,42,12],[5,3,5,8],[11,2,11,10],[17,1,17,3],[16,14,16,15],[16,6,16,7],[16,8,16,9],[5,11,7,17],[16,10,16,11],[48,8,48,12],[46,8,46,12],[47,8,47,12]]}
[]
[null,"ENTRADA DE DADOS POR SUBSISTEMA"]
[]
[]
[]
[null,"Subsistema n° 11:",null,null,null,null,null,null,null,null,"OBS"]
[]
[null,"ÁREA",null,"hectare(s)"]
[]
[]
[]
[null,null,"Horas Trabalhadas",null,null,null,null,null,null,null,null,"Observações"]
[null,null,"Mulher","Homem","Jovens Mulheres","Jovens Homens","Outras","Outros","Total Mulheres","Total Homens","TOTAL"]
[null,"N° Horas",null,null,null,null,null,null,{"$f":"C14+E14+G14","v":0},{"$f":"D14+F14+H14","v":0},{"$f":"C14+D14+E14+F14+G14+H14","v":0}]
[]
[null,"Produtos e Insumos Gerados",null,null,null,null,"Produtos",null,null,null,null,null,null,null,null,null,"Insumos Produzidos",null,"Total Produtos e Insumos",null,"Observações"]
[null,null,null,null,null,null,"Venda",null,"Autoconsumo",null,"Doações Trocas",null,"Estoque",null,"Total Produtos"]
[null,"Itens",null,null,"Unidade","Valor Unitário","Qtde","Valor Total","Qtde","Valor Total","Qtde","Valor Total","Qtde","Valor Total","Qtde","Valor Total","Qtde","Valor Total","Qtde","Valor Total"]
[null,null,null,null,null,null,0,{"$f":"G19*F19","v":0},0,{"$f":"I19*F19","v":0},0,{"$f":"K19*F19","v":0},0,{"$f":"M19*F19","v":0},{"$f":"G19+I19+K19+M19","v":0},{"$f":"F19*O19","v":0},0,{"$f":"Q19*F19","v":0},{"$f":"Q19+O19","v":0},{"$f":"S19*F19","v":0}]
[null,null,null,null,null,null,null,0,null,0,null,0,null,0,0,0,null,0,0,0]
[null,null,null,null,null,null,null,0,null,0,null,0,null,0,0,0,null,0,0,0]
[null,null,null,null,null,null,null,0,null,0,null,0,null,0,0,0,null,0,0,0]
[null,null,null,null,null,null,null,0,null,0,null,0,null,0,0,0,null,0,0,0]
[null,null,null,null,null,null,null,0,null,0,null,0,null,0,0,0,null,0,0,0]
[null,null,null,null,null,null,null,0,null,0,null,0,null,0,0,0,null,0,0,0]
[null,null,null,null,null,null,null,0,null,0,null,0,null,0,0,0,null,0,0,0]
[null,null,null,null,null,null,null,0,null,0,null,0,null,0,0,0,null,0,0,0]
[null,null,null,null,null,null,null,0,null,0,null,0,null,0,0,0,null,0,0,0]
[null,null,null,null,null,null,null,0,null,0,null,0,null,0,0,0,null,0,0,0]
[null,null,null,null,null,null,null,0,null,0,null,0,null,0,0,0,null,0,0,0]
[null,null,null,null,null,null,null,0,null,0,null,0,null,0,0,0,null,0,0,0]
[null,null,null,null,null,null,null,0,null,0,null,0,null,0,0,0,null,0,0,0]
[null,null,null,null,null,null,null,0,null,0,null,0,null,0,0,0,null,0,0,0]
[null,null,null,null,null,null,null,0,null,0,null,0,null,0,0,0,null,0,0,0]
[null,null,null,null,null,null,null,0,null,0,null,0,null,0,0,0,null,0,0,0]
[null,null,null,null,null,null,null,0,null,0,null,0,null,0,0,0,null,0,0,0]
[null,"Totais",null,null,null,null,null,{"$f":"SUM(H19:H36)","v":0},null,{"$f":"SUM(J19:J36)","v":0},null,{"$f":"SUM(L19:L36)","v":0},null,{"$f":"SUM(N19:N36)","v":0},null,{"$f":"SUM(P19:P36)","v":0},null,{"$f":"SUM(R19:R36)","v":0},null,{"$f":"SUM(T19:T36)","v":0}]
[]
[null,"Insumos"]
[null,"Produção Própria - Reciprocidade Ecológica",null,null,null,null,null,null,"Observações"]
[null,"Itens",null,null,"Unidade","Valor Unitário","Qtde","Valor Total"]
[null,null,null,null,null,null,null,{"$f":"G42*F42","v":0}]
[null,null,null,null,null,null,null,0]
[null,null,null,null,null,null,null,0]
[null,null,null,null,null,null,null,0]
[null,null,null,null,null,null,null,0]
[null,null,null,null,null,null,null,0]
[null,null,null,null,null,null,null,0]
[null,null,null,null,null,null,null,0]
[null,null,null,null,null,null,null,0]
[null,null,null,null,null,null,null,0]
[null,null,null,null,null,null,null,0]
[null,null,null,null,null,null,null,0]
[null,null,null,null,null,null,null,0]
[null,null,null,null,null,null,null,0]
[null,null,null,null,null,null,null,0]
[null,"Total Insumos -  Produção Própria",null,null,null,null,null,{"$f":"SUM(H42:H56)","v":0}]
[null,"Comprados - Consumos Intermediários ",null,null,null,null,null,null,null,"Observações"]
[null,"Insumos",null,null,"Unidade","Valor Unitário","Qtde","Valor Total","Origem"]
[null,null,null,null,null,null,null,{"$f":"G60*F60","v":0}]
[null,null,null,null,null,null,null,{"$f":"G61*F61","v":0}]
[null,null,null,null,null,null,null,0]
[null,null,null,null,null,null,null,0]
[null,null,null,null,null,null,null,0]
[null,null,null,null,null,null,null,0]
[null,null,null,null,null,null,null,0]
[null,null,null,null,null,null,null,0]
[null,null,null,null,null,null,null,0]
[null,null,null,null,null,null,null,0]
[null,null,null,null,null,null,null,0]
[null,null,null,null,null,null,null,0]
[null,null,null,null,null,null,null,0]
[null,null,null,null,null,null,null,0]
[null,null,null,null,null,null,null,0]
[null,null,null,null,null,null,null,0]
[null,null,null,null,null,null,null,0]
[null,null,null,null,null,null,null,0]
[null,null,null,null,null,null,null,0]
[null,null,null,null,null,null,null,0]
[null," Insumos Comprados no Território",null,null,null,null,null,{"$f":"DSUM(H59:I79,\"Valor Total\",G124:G125)","v":0}]
[null," Insumos Comprados Fora do Território",null,null,null,null,null,{"$f":"DSUM(H59:I79,\"Valor Total\",H124:H125)","v":0}]
[null,"Total de Insumos Comprados",null,null,null,null,null,{"$f":"SUM(H60:H79)","v":0}]
[]
[null,"Pagamento a Terceiros",null,null,null,null,null,null,null,"Observações"]
[null,"Serviços/Renda da Terra",null,null,"Unidade","Valor Unitário","Qtde","Valor Total","Origem"]
[null,null,null,null,null,null,null,{"$f":"G86*F86","v":0}]
[null,null,null,null,null,null,null,0]
[null,null,null,null,null,null,null,0]
[null,null,null,null,null,null,null,0]
[null,null,null,null,null,null,null,0]
[null,null,null,null,null,null,null,0]
[null,null,null,null,null,null,null,0]
[null,null,null,null,null,null,null,0]
[null,null,null,null,null,null,null,0]
[null,null,null,null,null,null,null,0]
[null,null,null,null,null,null,null,0]
[null,null,null,null,null,null,null,0]
[null,null,null,null,null,null,null,0]
[null,null,null,null,null,null,null,0]
[null,null,null,null,null,null,null,0]
[null,"Pagamentos a Terceiros do Território",null,null,null,null,null,{"$f":"DSUM(H85:I100,\"Valor Total\",G124:G125)","v":0}]
[null,"Pagamentos a Terceiros Fora do Território",null,null,null,null,null,{"$f":"DSUM(H85:I100,\"Valor Total\",H124:H125)","v":0}]
[null,"Total de Pagamentos a Terceiros ",null,null,null,null,null,{"$f":"SUM(H86:H100)","v":0}]
[]
[null,"Entrada de Recursos  por Reciprocidade",null,null,null,null,null,null,"Observações"]
[null,"Serviços e Insumos",null,null,"Unidade","Valor Unitário","Qtde","Valor Total"]
[null,null,null,null,null,null,null,{"$f":"G107*F107","v":0}]
[null,null,null,null,null,null,null,0]
[null,null,null,null,null,null,null,0]
[null,null,null,null,null,null,null,0]
[null,null,null,null,null,null,null,0]
[null,null,null,null,null,null,null,0]
[null,null,null,null,null,null,null,0]
[null,null,null,null,null,null,null,0]
[null,null,null,null,null,null,null,0]
[null,null,null,null,null,null,null,0]
[null,null,null,null,null,null,null,0]
[null,null,null,null,null,null,null,0]
[null,null,null,null,null,null,null,0]
[null,null,null,null,null,null,null,0]
[null,null,null,null,null,null,null,0]
[null,"Total Recursos por Reciprocidade",null,null,null,null,null,{"$f":"SUM(H107:H121)","v":0}]
[]
[null,null,null,null,null,null,"Origem","Origem"]
[null,null,null,null,null,null,"T","F"]

{"sheet":"SUB. 12","index":22,"n_rows":125,"n_cols":21,"rows_kept":125,"cut":false,"hidden":false,"merged":[[46,1,46,3],[47,1,47,3],[48,1,48,3],[51,1,51,3],[52,1,52,3],[53,1,53,3],[54,1,54,3],[56,1,56,3],[50,1,50,3],[121,1,121,3],[121,8,121,12],[118,1,118,3],[118,8,118,12],[119,1,119,3],[119,8,119,12],[114,1,114,3],[114,8,114,12],[120,1,120,3],[120,8,120,12],[115,1,115,3],[115,8,115,12],[116,1,116,3],[117,1,117,3],[117,8,117,12],[112,8,112,12],[113,1,113,3],[113,8,113,12],[112,1,112,3],[100,9,102,12],[104,8,105,12],[116,8,116,12],[107,1,107,3],[107,8,107,12],[108,1,108,3],[108,8,108,12],[109,1,109,3],[110,8,110,12],[111,1,111,3],[111,8,111,12],[104,1,104,7],[100,4,100,6],[101,4,101,6],[102,4,102,6],[100,1,100,3],[101,1,101,3],[102,1,102,3],[98,9,98,12],[99,1,99,3],[99,9,99,12],[109,8,109,12],[110,1,110,3],[105,1,105,3],[106,1,106,3],[106,8,106,12],[93,1,93,3],[93,9,93,12],[94,1,94,3],[94,9,94,12],[95,9,95,12],[96,1,96,3],[95,1,95,3],[98,1,98,3],[96,9,96,12],[97,1,97,3],[97,9,97,12],[88,1,88,3],[88,9,88,12],[89,1,89,3],[89,9,89,12],[90,9,90,12],[91,1,91,3],[90,1,90,3],[92,1,92,3],[92,9,92,12],[83,9,84,12],[84,1,84,3],[85,1,85,3],[78,1,78,3],[87,1,87,3],[87,9,87,12],[78,9,78,12],[79,1,79,3],[79,9,81,12],[80,1,80,3],[81,1,81,3],[85,9,85,12],[86,1,86,3],[86,9,86,12],[83,1,83,8],[79,4,79,6],[80,4,80,6],[81,4,81,6],[63,1,63,3],[63,9,63,12],[57,9,58,12],[58,1,58,3],[57,1,57,8],[48,8,48,12],[77,9,77,12],[71,1,71,3],[91,9,91,12],[74,1,74,3],[74,9,74,12],[75,1,75,3],[75,9,75,12],[76,1,76,3],[76,9,76,12],[71,9,71,12],[72,1,72,3],[77,1,77,3],[73,1,73,3],[73,9,73,12],[64,1,64,3],[64,9,64,12],[65,1,65,3],[65,9,65,12],[66,1,66,3],[66,9,66,12],[67,1,67,3],[67,9,67,12],[68,1,68,3],[68,9,68,12],[70,9,70,12],[69,1,69,3],[69,9,69,12],[70,1,70,3],[36,1,36,3],[36,20,36,21],[38,1,38,12],[39,8,40,12],[40,1,40,3],[44,8,44,12],[45,8,45,12],[39,1,39,7],[72,9,72,12],[41,1,41,3],[42,1,42,3],[43,1,43,3],[44,1,44,3],[45,1,45,3],[55,1,55,3],[49,1,49,3],[59,1,59,3],[59,9,59,12],[60,1,60,3],[60,9,60,12],[61,1,61,3],[61,9,61,12],[62,1,62,3],[62,9,62,12],[31,1,31,3],[31,20,31,21],[32,1,32,3],[32,20,32,21],[33,1,33,3],[33,20,33,21],[34,1,34,3],[35,1,35,3],[35,20,35,21],[26,1,26,3],[27,1,27,3],[28,1,28,3],[27,20,27,21],[28,20,28,21],[29,1,29,3],[29,20,29,21],[30,1,30,3],[30,20,30,21],[23,1,23,3],[23,20,23,21],[24,1,24,3],[24,20,24,21],[21,1,21,3],[22,1,22,3],[22,20,22,21],[25,1,25,3],[25,20,25,21],[1,1,1,21],[5,1,5,2],[26,20,26,21],[34,20,34,21],[15,1,16,5],[15,18,16,19],[15,6,15,15],[21,20,21,21],[18,1,18,3],[18,20,18,21],[19,1,19,3],[19,20,19,21],[20,1,20,3],[5,3,5,8],[11,2,11,10],[16,14,16,15],[16,6,16,7],[16,8,16,9],[16,10,16,11],[5,11,7,17],[15,16,16,17],[15,20,17,21],[17,1,17,3],[20,20,20,21],[56,8,56,12],[11,11,11,17],[12,11,13,17],[49,8,49,12],[50,8,50,12],[51,8,51,12],[52,8,52,12],[53,8,53,12],[46,8,46,12],[47,8,47,12],[16,12,16,13],[41,8,41,12],[42,8,42,12],[54,8,54,12],[43,8,43,12],[55,8,55,12],[47,15,47,16],[48,15,48,16],[49,15,49,16]]}
[]
[null,"ENTRADA DE DADOS POR SUBSISTEMA"]
[]
[]
[]
[null,"Subsistema n° 12:",null,null,null,null,null,null,null,null,"OBS"]
[]
[null,"ÁREA",null,"hectare(s)"]
[]
[]
[]
[null,null,"Horas Trabalhadas",null,null,null,null,null,null,null,null,"Observações"]
[null,null,"Mulher","Homem","Jovens Mulheres","Jovens Homens","Outras","Outros","Total Mulheres","Total Homens","TOTAL"]
[null,"N° Horas",null,null,null,null,null,null,{"$f":"C14+E14+G14","v":0},{"$f":"D14+F14+H14","v":0},{"$f":"C14+D14+E14+F14+G14+H14","v":0}]
[]
[null,"Produtos e Insumos Gerados",null,null,null,null,"Produtos",null,null,null,null,null,null,null,null,null,"Insumos Produzidos",null,"Total Produtos e Insumos",null,"Observações"]
[null,null,null,null,null,null,"Venda",null,"Autoconsumo",null,"Doações Trocas",null,"Estoque",null,"Total Produtos"]
[null,"Itens",null,null,"Unidade","Valor Unitário","Qtde","Valor Total","Qtde","Valor Total","Qtde","Valor Total","Qtde","Valor Total","Qtde","Valor Total","Qtde","Valor Total","Qtde","Valor Total"]
[null,null,null,null,null,null,0,{"$f":"G19*F19","v":0},0,{"$f":"I19*F19","v":0},0,{"$f":"K19*F19","v":0},0,{"$f":"M19*F19","v":0},{"$f":"G19+I19+K19+M19","v":0},{"$f":"F19*O19","v":0},null,{"$f":"Q19*F19","v":0},{"$f":"Q19+O19","v":0},{"$f":"S19*F19","v":0}]
[null,null,null,null,null,null,null,0,null,0,null,0,null,0,0,0,null,0,0,0]
[null,null,null,null,null,null,null,0,null,0,null,0,null,0,0,0,null,0,0,0]
[null,null,null,null,null,null,null,0,null,0,null,0,null,0,0,0,null,0,0,0]
[null,null,null,null,null,null,null,0,null,0,null,0,null,0,0,0,null,0,0,0]
[null,null,null,null,null,null,null,0,null,0,null,0,null,0,0,0,null,0,0,0]
[null,null,null,null,null,null,null,0,null,0,null,0,null,0,0,0,null,0,0,0]
[null,null,null,null,null,null,null,0,null,0,null,0,null,0,0,0,null,0,0,0]
[null,null,null,null,null,null,null,0,null,0,null,0,null,0,0,0,null,0,0,0]
[null,null,null,null,null,null,null,0,null,0,null,0,null,0,0,0,null,0,0,0]
[null,null,null,null,null,null,null,0,null,0,null,0,null,0,0,0,null,0,0,0]
[null,null,null,null,null,null,null,0,null,0,null,0,null,0,0,0,null,0,0,0]
[null,null,null,null,null,null,null,0,null,0,null,0,null,0,0,0,null,0,0,0]
[null,null,null,null,null,null,null,0,null,0,null,0,null,0,0,0,null,0,0,0]
[null,null,null,null,null,null,null,0,null,0,null,0,null,0,0,0,null,0,0,0]
[null,null,null,null,null,null,null,0,null,0,null,0,null,0,0,0,null,0,0,0]
[null,null,null,null,null,null,null,0,null,0,null,0,null,0,0,0,null,0,0,0]
[null,null,null,null,null,null,null,0,null,0,null,0,null,0,0,0,null,0,0,0]
[null,"Totais",null,null,null,null,null,{"$f":"SUM(H19:H36)","v":0},null,{"$f":"SUM(J19:J36)","v":0},null,{"$f":"SUM(L19:L36)","v":0},null,{"$f":"SUM(N19:N36)","v":0},null,{"$f":"SUM(P19:P36)","v":0},null,{"$f":"SUM(R19:R36)","v":0},null,{"$f":"SUM(T19:T36)","v":0}]
[]
[null,"Insumos"]
[null,"Produção Própria - Reciprocidade Ecológica",null,null,null,null,null,null,"Observações"]
[null,"Itens",null,null,"Unidade","Valor Unitário","Qtde","Valor Total"]
[null,null,null,null,null,null,null,{"$f":"G42*F42","v":0}]
[null,null,null,null,null,null,null,0]
[null,null,null,null,null,null,null,0]
[null,null,null,null,null,null,null,0]
[null,null,null,null,null,null,null,0]
[null,null,null,null,null,null,null,0]
[null,null,null,null,null,null,null,0]
[null,null,null,null,null,null,null,0]
[null,null,null,null,null,null,null,0]
[null,null,null,null,null,null,null,0]
[null,null,null,null,null,null,null,0]
[null,null,null,null,null,null,null,0]
[null,null,null,null,null,null,null,0]
[null,null,null,null,null,null,null,0]
[null,null,null,null,null,null,null,0]
[null,"Total Insumos -  Produção Própria",null,null,null,null,null,{"$f":"SUM(H42:H56)","v":0}]
[null,"Comprados - Consumos Intermediários ",null,null,null,null,null,null,null,"Observações"]
[null,"Insumos",null,null,"Unidade","Valor Unitário","Qtde","Valor Total","Origem"]
[null,null,null,null,null,null,null,{"$f":"G60*F60","v":0}]
[null,null,null,null,null,null,null,{"$f":"G61*F61","v":0}]
[null,null,null,null,null,null,null,0]
[null,null,null,null,null,null,null,0]
[null,null,null,null,null,null,null,0]
[null,null,null,null,null,null,null,0]
[null,null,null,null,null,null,null,0]
[null,null,null,null,null,null,null,0]
[null,null,null,null,null,null,null,0]
[null,null,null,null,null,null,null,0]
[null,null,null,null,null,null,null,0]
[null,null,null,null,null,null,null,0]
[null,null,null,null,null,null,null,0]
[null,null,null,null,null,null,null,0]
[null,null,null,null,null,null,null,0]
[null,null,null,null,null,null,null,0]
[null,null,null,null,null,null,null,0]
[null,null,null,null,null,null,null,0]
[null,null,null,null,null,null,null,0]
[null,null,null,null,null,null,null,0]
[null," Insumos Comprados no Território",null,null,null,null,null,{"$f":"DSUM(H59:I79,\"Valor Total\",G124:G125)","v":0}]
[null," Insumos Comprados Fora do Território",null,null,null,null,null,{"$f":"DSUM(H59:I79,\"Valor Total\",H124:H125)","v":0}]
[null,"Total de Insumos Comprados",null,null,null,null,null,{"$f":"SUM(H60:H79)","v":0}]
[]
[null,"Pagamento a Terceiros",null,null,null,null,null,null,null,"Observações"]
[null,"Serviços/Renda da Terra",null,null,"Unidade","Valor Unitário","Qtde","Valor Total","Origem"]
[null,null,null,null,null,null,null,{"$f":"G86*F86","v":0}]
[null,null,null,null,null,null,null,0]
[null,null,null,null,null,null,null,0]
[null,null,null,null,null,null,null,0]
[null,null,null,null,null,null,null,0]
[null,null,null,null,null,null,null,0]
[null,null,null,null,null,null,null,0]
[null,null,null,null,null,null,null,0]
[null,null,null,null,null,null,null,0]
[null,null,null,null,null,null,null,0]
[null,null,null,null,null,null,null,0]
[null,null,null,null,null,null,null,0]
[null,null,null,null,null,null,null,0]
[null,null,null,null,null,null,null,0]
[null,null,null,null,null,null,null,0]
[null,"Pagamentos a Terceiros do Território",null,null,null,null,null,{"$f":"DSUM(H85:I100,\"Valor Total\",G124:G125)","v":0}]
[null,"Pagamentos a Terceiros Fora do Território",null,null,null,null,null,{"$f":"DSUM(H85:I100,\"Valor Total\",H124:H125)","v":0}]
[null,"Total de Pagamentos a Terceiros ",null,null,null,null,null,{"$f":"SUM(H86:H100)","v":0}]
[]
[null,"Entrada de Recursos  por Reciprocidade",null,null,null,null,null,null,"Observações"]
[null,"Serviços e Insumos",null,null,"Unidade","Valor Unitário","Qtde","Valor Total"]
[null,null,null,null,null,null,null,{"$f":"G107*F107","v":0}]
[null,null,null,null,null,null,null,0]
[null,null,null,null,null,null,null,0]
[null,null,null,null,null,null,null,0]
[null,null,null,null,null,null,null,0]
[null,null,null,null,null,null,null,0]
[null,null,null,null,null,null,null,0]
[null,null,null,null,null,null,null,0]
[null,null,null,null,null,null,null,0]
[null,null,null,null,null,null,null,0]
[null,null,null,null,null,null,null,0]
[null,null,null,null,null,null,null,0]
[null,null,null,null,null,null,null,0]
[null,null,null,null,null,null,null,0]
[null,null,null,null,null,null,null,0]
[null,"Total Recursos por Reciprocidade",null,null,null,null,null,{"$f":"SUM(H107:H121)","v":0}]
[]
[null,null,null,null,null,null,"Origem","Origem"]
[null,null,null,null,null,null,"T","F"]

{"sheet":"SUB. Extrativista","index":23,"n_rows":125,"n_cols":21,"rows_kept":125,"cut":false,"hidden":false,"merged":[[5,11,7,17],[39,1,39,7],[57,1,57,8],[83,1,83,8],[104,1,104,7],[79,4,79,6],[80,4,80,6],[81,4,81,6],[100,4,100,6],[101,4,101,6],[102,4,102,6],[100,1,100,3],[101,1,101,3],[102,1,102,3],[96,9,96,12],[98,1,98,3],[98,9,98,12],[99,1,99,3],[99,9,99,12],[100,9,102,12],[91,9,91,12],[93,1,93,3],[93,9,93,12],[94,1,94,3],[121,8,121,12],[118,1,118,3],[118,8,118,12],[119,1,119,3],[119,8,119,12],[120,1,120,3],[120,8,120,12],[121,1,121,3],[115,1,115,3],[115,8,115,12],[116,1,116,3],[116,8,116,12],[112,1,112,3],[110,8,110,12],[112,8,112,12],[113,1,113,3],[113,8,113,12],[114,1,114,3],[114,8,114,12],[105,1,105,3],[117,1,117,3],[117,8,117,12],[107,1,107,3],[107,8,107,12],[108,1,108,3],[108,8,108,12],[109,1,109,3],[109,8,109,12],[110,1,110,3],[111,1,111,3],[111,8,111,12],[104,8,105,12],[106,1,106,3],[106,8,106,12],[95,1,95,3],[95,9,95,12],[96,1,96,3],[87,1,87,3],[97,1,97,3],[97,9,97,12],[88,1,88,3],[88,9,88,12],[89,1,89,3],[89,9,89,12],[90,1,90,3],[90,9,90,12],[91,1,91,3],[79,9,81,12],[80,1,80,3],[81,1,81,3],[77,1,77,3],[77,9,77,12],[71,1,71,3],[79,1,79,3],[73,9,73,12],[94,9,94,12],[92,1,92,3],[92,9,92,12],[83,9,84,12],[84,1,84,3],[85,1,85,3],[85,9,85,12],[86,1,86,3],[86,9,86,12],[87,9,87,12],[67,1,67,3],[68,1,68,3],[78,1,78,3],[78,9,78,12],[70,9,70,12],[67,9,67,12],[64,1,64,3],[64,9,64,12],[65,1,65,3],[75,9,75,12],[76,1,76,3],[76,9,76,12],[69,1,69,3],[69,9,69,12],[70,1,70,3],[72,1,72,3],[72,9,72,12],[75,1,75,3],[73,1,73,3],[74,1,74,3],[74,9,74,12],[68,9,68,12],[71,9,71,12],[57,9,58,12],[58,1,58,3],[60,1,60,3],[42,8,42,12],[65,9,65,12],[66,1,66,3],[66,9,66,12],[45,1,45,3],[60,9,60,12],[61,1,61,3],[43,1,43,3],[44,1,44,3],[46,1,46,3],[47,1,47,3],[48,1,48,3],[51,1,51,3],[52,1,52,3],[53,1,53,3],[54,1,54,3],[49,1,49,3],[61,9,61,12],[50,1,50,3],[55,1,55,3],[56,1,56,3],[32,1,32,3],[62,1,62,3],[62,9,62,12],[63,1,63,3],[40,1,40,3],[32,20,32,21],[33,1,33,3],[33,20,33,21],[59,1,59,3],[47,8,47,12],[48,8,48,12],[55,8,55,12],[56,8,56,12],[52,8,52,12],[53,8,53,12],[51,8,51,12],[35,20,35,21],[36,1,36,3],[36,20,36,21],[38,1,38,12],[39,8,40,12],[41,8,41,12],[42,1,42,3],[59,9,59,12],[19,20,19,21],[20,1,20,3],[20,20,20,21],[22,20,22,21],[63,9,63,12],[34,1,34,3],[34,20,34,21],[35,1,35,3],[25,1,25,3],[41,1,41,3],[29,1,29,3],[29,20,29,21],[27,20,27,21],[28,20,28,21],[25,20,25,21],[30,20,30,21],[54,8,54,12],[43,8,43,12],[44,8,44,12],[45,8,45,12],[46,8,46,12],[30,1,30,3],[31,1,31,3],[31,20,31,21],[16,6,16,7],[22,1,22,3],[19,1,19,3],[11,2,11,10],[27,1,27,3],[28,1,28,3],[18,1,18,3],[21,1,21,3],[17,1,17,3],[26,1,26,3],[23,1,23,3],[24,1,24,3],[47,15,47,16],[48,15,48,16],[49,15,49,16],[1,1,1,21],[5,1,5,2],[11,11,11,17],[12,11,13,17],[49,8,49,12],[50,8,50,12],[21,20,21,21],[15,16,16,17],[15,20,17,21],[5,3,5,8],[18,20,18,21],[26,20,26,21],[16,10,16,11],[16,12,16,13],[15,1,16,5],[15,18,16,19],[15,6,15,15],[16,8,16,9],[23,20,23,21],[24,20,24,21],[16,14,16,15]]}
[]
[null,"ENTRADA DE DADOS POR SUBSISTEMA"]
[]
[]
[]
[null,"Subsistema Extrativiasta:",null,null,null,null,null,null,null,null,"OBS"]
[]
[]
[]
[]
[]
[null,null,"Horas Trabalhadas",null,null,null,null,null,null,null,null,"Observações"]
[null,null,"Mulher","Homem","Jovens Mulheres","Jovens Homens","Outras","Outros","Total Mulheres","Total Homens","TOTAL"]
[null,"N° Horas",null,null,null,null,null,null,{"$f":"C14+E14+G14","v":0},{"$f":"D14+F14+H14","v":0},{"$f":"C14+D14+E14+F14+G14+H14","v":0}]
[]
[null,"Produtos e Insumos Gerados",null,null,null,null,"Produtos",null,null,null,null,null,null,null,null,null,"Insumos Produzidos",null,"Total Produtos e Insumos",null,"Observações"]
[null,null,null,null,null,null,"Venda",null,"Autoconsumo",null,"Doações Trocas",null,"Estoque",null,"Total Produtos"]
[null,"Itens",null,null,"Unidade","Valor Unitário","Qtde","Valor Total","Qtde","Valor Total","Qtde","Valor Total","Qtde","Valor Total","Qtde","Valor Total","Qtde","Valor Total","Qtde","Valor Total"]
[null,null,null,null,null,null,null,{"$f":"G19*F19","v":0},null,{"$f":"I19*F19","v":0},null,{"$f":"K19*F19","v":0},0,{"$f":"M19*F19","v":0},{"$f":"G19+I19+K19+M19","v":0},{"$f":"F19*O19","v":0},0,{"$f":"Q19*F19","v":0},{"$f":"Q19+O19","v":0},{"$f":"S19*F19","v":0}]
[null,null,null,null,null,null,null,0,null,0,null,0,null,0,0,0,null,0,0,0]
[null,null,null,null,null,null,null,0,null,0,null,0,null,0,0,0,null,0,0,0]
[null,null,null,null,null,null,null,0,null,0,null,0,null,0,0,0,null,0,0,0]
[null,null,null,null,null,null,null,0,null,0,null,0,null,0,0,0,null,0,0,0]
[null,null,null,null,null,null,null,0,null,0,null,0,null,0,0,0,null,0,0,0]
[null,null,null,null,null,null,null,0,null,0,null,0,null,0,0,0,null,0,0,0]
[null,null,null,null,null,null,null,0,null,0,null,0,null,0,0,0,null,0,0,0]
[null,null,null,null,null,null,null,0,null,0,null,0,null,0,0,0,null,0,0,0]
[null,null,null,null,null,null,null,0,null,0,null,0,null,0,0,0,null,0,0,0]
[null,null,null,null,null,null,null,0,null,0,null,0,null,0,0,0,null,0,0,0]
[null,null,null,null,null,null,null,0,null,0,null,0,null,0,0,0,null,0,0,0]
[null,null,null,null,null,null,null,0,null,0,null,0,null,0,0,0,null,0,0,0]
[null,null,null,null,null,null,null,0,null,0,null,0,null,0,0,0,null,0,0,0]
[null,null,null,null,null,null,null,0,null,0,null,0,null,0,0,0,null,0,0,0]
[null,null,null,null,null,null,null,0,null,0,null,0,null,0,0,0,null,0,0,0]
[null,null,null,null,null,null,null,0,null,0,null,0,null,0,0,0,null,0,0,0]
[null,null,null,null,0.01,0.01,0.01,1E-4,null,0,null,0,null,0,0.01,1E-4,null,0,0.01,1E-4]
[null,"Totais",null,null,null,null,null,{"$f":"SUM(H19:H36)","v":1E-4},null,{"$f":"SUM(J19:J36)","v":0},null,{"$f":"SUM(L19:L36)","v":0},null,{"$f":"SUM(N19:N36)","v":0},null,{"$f":"SUM(P19:P36)","v":1E-4},null,{"$f":"SUM(R19:R36)","v":0},null,{"$f":"SUM(T19:T36)","v":1E-4}]
[]
[null,"Insumos"]
[null,"Produção Própria - Reciprocidade Ecológica",null,null,null,null,null,null,"Observações"]
[null,"Itens",null,null,"Unidade","Valor Unitário","Qtde","Valor Total"]
[null,null,null,null,null,null,null,{"$f":"G42*F42","v":0}]
[null,null,null,null,null,null,null,0]
[null,null,null,null,null,null,null,0]
[null,null,null,null,null,null,null,0]
[null,null,null,null,null,null,null,0]
[null,null,null,null,null,null,null,0]
[null,null,null,null,null,null,null,0]
[null,null,null,null,null,null,null,0]
[null,null,null,null,null,null,null,0]
[null,null,null,null,null,null,null,0]
[null,null,null,null,null,null,null,0]
[null,null,null,null,null,null,null,0]
[null,null,null,null,null,null,null,0]
[null,null,null,null,null,null,null,0]
[null,null,null,null,null,null,null,0]
[null,"Total Insumos -  Produção Própria",null,null,null,null,null,{"$f":"SUM(H42:H56)","v":0}]
[null,"Comprados - Consumos Intermediários ",null,null,null,null,null,null,null,"Observações"]
[null,"Insumos",null,null,"Unidade","Valor Unitário","Qtde","Valor Total","Origem"]
[null,null,null,null,null,null,null,{"$f":"G60*F60","v":0}]
[null,null,null,null,null,null,null,{"$f":"G61*F61","v":0}]
[null,null,null,null,null,null,null,0]
[null,null,null,null,null,null,null,0]
[null,null,null,null,null,null,null,0]
[null,null,null,null,null,null,null,0]
[null,null,null,null,null,null,null,0]
[null,null,null,null,null,null,null,0]
[null,null,null,null,null,null,null,0]
[null,null,null,null,null,null,null,0]
[null,null,null,null,null,null,null,0]
[null,null,null,null,null,null,null,0]
[null,null,null,null,null,null,null,0]
[null,null,null,null,null,null,null,0]
[null,null,null,null,null,null,null,0]
[null,null,null,null,null,null,null,0]
[null,null,null,null,null,null,null,0]
[null,null,null,null,null,null,null,0]
[null,null,null,null,null,null,null,0]
[null,null,null,null,null,null,null,0]
[null," Insumos Comprados no Território",null,null,null,null,null,{"$f":"DSUM(H59:I79,\"Valor Total\",G124:G125)","v":0}]
[null," Insumos Comprados Fora do Território",null,null,null,null,null,{"$f":"DSUM(H59:I79,\"Valor Total\",H124:H125)","v":0}]
[null,"Total de Insumos Comprados",null,null,null,null,null,{"$f":"SUM(H60:H79)","v":0}]
[]
[null,"Pagamento a Terceiros",null,null,null,null,null,null,null,"Observações"]
[null,"Serviços/Renda da Terra",null,null,"Unidade","Valor Unitário","Qtde","Valor Total","Origem"]
[null,null,null,null,null,null,null,{"$f":"G86*F86","v":0}]
[null,null,null,null,null,null,null,0]
[null,null,null,null,null,null,null,0]
[null,null,null,null,null,null,null,0]
[null,null,null,null,null,null,null,0]
[null,null,null,null,null,null,null,0]
[null,null,null,null,null,null,null,0]
[null,null,null,null,null,null,null,0]
[null,null,null,null,null,null,null,0]
[null,null,null,null,null,null,null,0]
[null,null,null,null,null,null,null,0]
[null,null,null,null,null,null,null,0]
[null,null,null,null,null,null,null,0]
[null,null,null,null,null,null,null,0]
[null,null,null,null,null,null,null,0]
[null,"Pagamentos a Terceiros do Território",null,null,null,null,null,{"$f":"DSUM(H85:I100,\"Valor Total\",G124:G125)","v":0}]
[null,"Pagamentos a Terceiros Fora do Território",null,null,null,null,null,{"$f":"DSUM(H85:I100,\"Valor Total\",H124:H125)","v":0}]
[null,"Total de Pagamentos a Terceiros ",null,null,null,null,null,{"$f":"SUM(H86:H100)","v":0}]
[]
[null,"Entrada de Recursos  por Reciprocidade",null,null,null,null,null,null,"Observações"]
[null,"Serviços e Insumos",null,null,"Unidade","Valor Unitário","Qtde","Valor Total"]
[null,null,null,null,null,null,null,{"$f":"G107*F107","v":0}]
[null,null,null,null,null,null,null,0]
[null,null,null,null,null,null,null,0]
[null,null,null,null,null,null,null,0]
[null,null,null,null,null,null,null,0]
[null,null,null,null,null,null,null,0]
[null,null,null,null,null,null,null,0]
[null,null,null,null,null,null,null,0]
[null,null,null,null,null,null,null,0]
[null,null,null,null,null,null,null,0]
[null,null,null,null,null,null,null,0]
[null,null,null,null,null,null,null,0]
[null,null,null,null,null,null,null,0]
[null,null,null,null,null,null,null,0]
[null,null,null,null,null,null,null,0]
[null,"Total Recursos por Reciprocidade",null,null,null,null,null,{"$f":"SUM(H107:H121)","v":0}]
[]
[null,null,null,null,null,null,"Origem","Origem"]
[null,null,null,null,null,null,"T","F"]

{"sheet":"Tabelas Dinâmicas 1","index":24,"n_rows":92,"n_cols":28,"rows_kept":92,"cut":false,"hidden":true,"merged":[[75,8,75,10],[2,0,2,13],[2,17,2,25],[4,6,4,8],[4,10,4,12],[42,0,42,1],[23,0,23,2],[5,0,5,4],[8,17,8,21],[8,23,8,25],[24,19,24,21],[24,25,24,27],[75,14,75,16],[75,11,75,13]]}
[]
[]
["Tabelas de composição dos gráficos 1",null,null,null,null,null,null,null,null,null,null,null,null,null,null,null,null,"Tabelas Dinâmicas de composição dos  gráficos 1"]
[]
[null,null,null,null,null,null,"Gráfico 2 - Composição Renda Bruta",null,null,null,"Gráfico 3 - Renda Bruta II"]
["Gráfico 1 - Composição Produto Bruto"]
["Subsistema","Venda","Autoconsumo","Trocas e doações","Estoque",null,"Subsistema ","Valor Agregado Bruto","Consumos Intermediários",null,"Subsistema","Valor Agregado Territorial","Consumos Intermediários - Fora do Território"]
["Agroecossistema",{"$f":"SUM(B9:B21)","v":18656.800100000004},{"$f":"SUM(C9:C21)","v":4410.2},{"$f":"SUM(D9:D21)","v":2512.6666666666665},{"$f":"SUM(E9:E21)","v":15283.557692307693},null,"Agroecossistema",{"$f":"SUM(H9:H21)","v":21410.435997435899},{"$f":"SUM(I9:I21)","v":4169.2307692307695},null,{"$f":"A8","v":"Agroecossistema"},{"$f":"SUM(L9:L21)","v":23730.435997435899},{"$f":"SUM(M9:M21)","v":1849.2307692307693}]
[{"$f":"'Indicadores I'!B17","v":"Bovino"},{"$f":"'Indicadores I'!D17","v":10236.800000000001},{"$f":"'Indicadores I'!E17","v":211.20000000000002},{"$f":"'Indicadores I'!F17","v":220.00000000000003},{"$f":"'Indicadores I'!G17","v":7692.3076923076933},null,{"$f":"A9","v":"Bovino"},{"$f":"'Indicadores I'!D37","v":8508.0000000000018},{"$f":"'Indicadores I'!K17","v":2160},null,"Bovino",{"$f":"'Indicadores I'!E37","v":10308.000000000002},{"$f":"'Indicadores I'!J17","v":360},null,null,null,null,{"$f":"A6","v":"Gráfico 1 - Composição Produto Bruto"},null,null,null,null,null,{"$f":"K5","v":"Gráfico 3 - Renda Bruta II"}]
[{"$f":"'Indicadores I'!B18","v":"Suino"},{"$f":"'Indicadores I'!D18","v":7830},{"$f":"'Indicadores I'!E18","v":900},{"$f":"'Indicadores I'!F18","v":1500},{"$f":"'Indicadores I'!G18","v":6600},null,"Suino",{"$f":"'Indicadores I'!D38","v":9110},{"$f":"'Indicadores I'!K18","v":1120},null,"Suino",{"$f":"'Indicadores I'!E38","v":9270},{"$f":"'Indicadores I'!J18","v":960},null,null,null,null,null,"Dados",null,null,null,null,null,"Dados"]
[{"$f":"'Indicadores I'!B19","v":"Ovino"},{"$f":"'Indicadores I'!D19","v":180},{"$f":"'Indicadores I'!E19","v":0},{"$f":"'Indicadores I'!F19","v":0},{"$f":"'Indicadores I'!G19","v":225},null,"Ovino",{"$f":"'Indicadores I'!D39","v":180},{"$f":"'Indicadores I'!K19","v":0},null,"Ovino",{"$f":"'Indicadores I'!E39","v":180},{"$f":"'Indicadores I'!J19","v":0},null,null,null,null,"Subsistema","Estoque.","Trocas e doações.","Autoconsumo.","Venda.",null,"Subsistema","Consumos Intermediários - Fora do Território.","Valor Agregado Territorial."]
[{"$f":"'Indicadores I'!B20","v":"Aves"},{"$f":"'Indicadores I'!D20","v":210},{"$f":"'Indicadores I'!E20","v":1980},{"$f":"'Indicadores I'!F20","v":376.66666666666669},{"$f":"'Indicadores I'!G20","v":766.25},null,"Aves",{"$f":"'Indicadores I'!D40","v":2197.4358974358975},{"$f":"'Indicadores I'!K20","v":369.23076923076923},null,"Aves",{"$f":"'Indicadores I'!E40","v":2197.4358974358975},{"$f":"'Indicadores I'!J20","v":369.23076923076923},null,null,null,null,"Agroecossistema",15283.557692307693,1052.6666666666667,3660.2,18656.800100000004,null,"Agroecossistema",1849.2307692307693,21520.435997435899]
[{"$f":"'Indicadores I'!B21","v":"Lavoura Milho e palma"},{"$f":"'Indicadores I'!D21","v":200},{"$f":"'Indicadores I'!E21","v":50},{"$f":"'Indicadores I'!F21","v":20},{"$f":"'Indicadores I'!G21","v":0},null,"Lavoura Milho e palma",{"$f":"'Indicadores I'!D41","v":-250},{"$f":"'Indicadores I'!K21","v":520},null,"Lavoura Milho e palma",{"$f":"'Indicadores I'!E41","v":110},{"$f":"'Indicadores I'!J21","v":160},null,null,null,null,"Aves",766.25,376.66666666666669,1980,210,null,"Bovino",360,10198.000000000002]
[{"$f":"'Indicadores I'!B22","v":"Quintal - frutas e medicinais"},{"$f":"'Indicadores I'!D22","v":0},{"$f":"'Indicadores I'!E22","v":1269},{"$f":"'Indicadores I'!F22","v":396},{"$f":"'Indicadores I'!G22","v":0},null,"Quintal - frutas e medicinais",{"$f":"'Indicadores I'!D42","v":1665},{"$f":"'Indicadores I'!K22","v":0},null,"Quintal - frutas e medicinais",{"$f":"'Indicadores I'!E42","v":1665},{"$f":"'Indicadores I'!J22","v":0},null,null,null,null,"Bovino",7692.3076923076933,110.00000000000001,211.20000000000002,10236.800000000001,null,"Suino",960,7170]
[{"$f":"'Indicadores I'!B23","v":0},{"$f":"'Indicadores I'!D23","v":0},{"$f":"'Indicadores I'!E23","v":0},{"$f":"'Indicadores I'!F23","v":0},{"$f":"'Indicadores I'!G23","v":0},null,0,{"$f":"'Indicadores I'!D43","v":0},{"$f":"'Indicadores I'!K23","v":0},null,0,{"$f":"'Indicadores I'!E43","v":0},{"$f":"'Indicadores I'!J23","v":0},null,null,null,null,"Lavoura Milho e palma",0,20,50,200,null,"Ovino",0,180]
[{"$f":"'Indicadores I'!B24","v":0},{"$f":"'Indicadores I'!D24","v":0},{"$f":"'Indicadores I'!E24","v":0},{"$f":"'Indicadores I'!F24","v":0},{"$f":"'Indicadores I'!G24","v":0},null,0,{"$f":"'Indicadores I'!D44","v":0},{"$f":"'Indicadores I'!K24","v":0},null,0,{"$f":"'Indicadores I'!E44","v":0},{"$f":"'Indicadores I'!J24","v":0},null,null,null,null,"Ovino",225,0,0,180,null,"Aves",369.23076923076923,2197.4358974358975]
[{"$f":"'Indicadores I'!B25","v":0},{"$f":"'Indicadores I'!D25","v":0},{"$f":"'Indicadores I'!E25","v":0},{"$f":"'Indicadores I'!F25","v":0},{"$f":"'Indicadores I'!G25","v":0},null,0,{"$f":"'Indicadores I'!D45","v":0},{"$f":"'Indicadores I'!K25","v":0},null,0,{"$f":"'Indicadores I'!E45","v":0},{"$f":"'Indicadores I'!J25","v":0},null,null,null,null,"Quintal - frutas e medicinais",0,396,1269,0,null,"Lavoura Milho e palma",160,110]
[{"$f":"'Indicadores I'!B26","v":0},{"$f":"'Indicadores I'!D26","v":0},{"$f":"'Indicadores I'!E26","v":0},{"$f":"'Indicadores I'!F26","v":0},{"$f":"'Indicadores I'!G26","v":0},null,0,{"$f":"'Indicadores I'!D46","v":0},{"$f":"'Indicadores I'!K26","v":0},null,0,{"$f":"'Indicadores I'!E46","v":0},{"$f":"'Indicadores I'!J26","v":0},null,null,null,null,"Suino",6600,150,150,7830,null,"Quintal - frutas e medicinais",0,1665]
[{"$f":"'Indicadores I'!B27","v":0},{"$f":"'Indicadores I'!D27","v":0},{"$f":"'Indicadores I'!E27","v":0},{"$f":"'Indicadores I'!F27","v":0},{"$f":"'Indicadores I'!G27","v":0},null,0,{"$f":"'Indicadores I'!D47","v":0},{"$f":"'Indicadores I'!K27","v":0},null,0,{"$f":"'Indicadores I'!E47","v":0},{"$f":"'Indicadores I'!J27","v":0}]
[{"$f":"'Indicadores I'!B28","v":0},{"$f":"'Indicadores I'!D28","v":0},{"$f":"'Indicadores I'!E28","v":0},{"$f":"'Indicadores I'!F28","v":0},{"$f":"'Indicadores I'!G28","v":0},null,0,{"$f":"'Indicadores I'!D48","v":0},{"$f":"'Indicadores I'!K28","v":0},null,0,{"$f":"'Indicadores I'!E48","v":0},{"$f":"'Indicadores I'!J28","v":0}]
[{"$f":"'Indicadores I'!B29","v":0},{"$f":"'Indicadores I'!D29","v":1E-4},{"$f":"'Indicadores I'!E29","v":0},{"$f":"'Indicadores I'!F29","v":0},{"$f":"'Indicadores I'!G29","v":0},null,0,{"$f":"'Indicadores I'!D49","v":1E-4},{"$f":"'Indicadores I'!K29","v":0},null,0,{"$f":"'Indicadores I'!E49","v":1E-4},{"$f":"'Indicadores I'!J29","v":0}]
[{"$f":"'Indicadores I'!B31","v":"Agroecossistema"},{"$f":"'Indicadores I'!D31","v":18656.800100000004},{"$f":"'Indicadores I'!E31","v":4410.2},{"$f":"'Indicadores I'!F31","v":2512.6666666666665},{"$f":"'Indicadores I'!G31","v":15283.557692307693}]
[]
["Renda Monetária Bruta",null,null,null,"Intensidade do uso da Terra por Unidade de Trabalho"]
["Subsistema ","Renda Agrícola Monetária (RAM)","Custos Produtivos",null,null,"VA/UTF","Área (ha)/UTF","VA/UTF","Área (ha)/UTF (a)","VA/UTF","Área (ha)/UTF (b)",null,"Área (ha)/UTF ©","VA/UTF",null,null,null,null,null,{"$f":"G5","v":"Gráfico 2 - Composição Renda Bruta"},null,null,null,null,null,{"$f":"A24","v":"Renda Monetária Bruta"}]
["Agroecossistema",{"$f":"SUM(B27:B39)","v":13827.569330769231},{"$f":"SUM(C27:C38)","v":4829.2307692307695},null,"Agroecossistema",0,null,0,null,0,null,"Agroecossistema",0,0,null,null,null,null,null,null,"Dados",null,null,null,null,null,"Dados"]
[{"$f":"A9","v":"Bovino"},{"$f":"'Indicadores I'!J37","v":8076.8000000000011},{"$f":"'Indicadores I'!O17","v":2160},null,{"$f":"A27","v":"Bovino"},{"$f":"'Indicadores I'!Q76","v":1849.5652173913049},{"$f":"'Indicadores I'!R76","v":0.98695652173913051},{"$f":"F27","v":1849.5652173913049},{"$f":"G27","v":0.98695652173913051},{"$f":"IF(H27>0,H27,NA())","v":1849.5652173913049},{"$f":"G27","v":0.98695652173913051},{"$f":"E27","v":"Bovino"},{"$f":"K27","v":0.98695652173913051},{"$f":"J27","v":1849.5652173913049},null,null,null,null,null,"Subsistema ","Consumos Intermediários.","Valor Agregado.",null,null,null,"Subsistema ","Renda Agrícola Monetária (RAM).","Custos Produtivos."]
[{"$f":"A10","v":"Suino"},{"$f":"'Indicadores I'!J38","v":6710},{"$f":"'Indicadores I'!O18","v":1120},null,{"$f":"A28","v":"Suino"},{"$f":"'Indicadores I'!Q77","v":1980.4347826086957},{"$f":"'Indicadores I'!R77","v":2.1739130434782609E-3},{"$f":"IF(F28>0,SUM(F27+F28),NA())","v":3830.0000000000009},{"$f":"IF(G28>0,SUM(G27+G28),NA())","v":0.98913043478260876},{"$f":"IF(H28>0,H28,NA())","v":3830.0000000000009},{"$f":"IF(I28>0,I28,NA())","v":0.98913043478260876},"Suino",{"$f":"K28","v":0.98913043478260876},3830.0000000000009,null,null,null,null,null,"Agroecossistema",4169.2307692307695,19200.435997435899,null,null,null,"Agroecossistema",13827.569330769231,4829.2307692307695]
["Ovino",{"$f":"'Indicadores I'!J39","v":180},{"$f":"'Indicadores I'!O19","v":0},null,"Ovino",{"$f":"'Indicadores I'!Q78","v":39.130434782608695},{"$f":"'Indicadores I'!R78","v":0.98695652173913051},{"$f":"IF(F29>0,SUM(F27+F28+F29),NA())","v":3869.1304347826094},{"$f":"IF(G29>0,SUM(G27+G28+G29),NA())","v":1.9760869565217392},3869.1304347826094,{"$f":"IF(I29>0,I29,NA())","v":1.9760869565217392},"Ovino",1.9760869565217392,3869.1304347826094,null,null,null,null,null,"Bovino",2160,8398.0000000000018,null,null,null,"Bovino",8076.8000000000011,2160]
["Aves",{"$f":"'Indicadores I'!J40","v":-159.23076923076923},{"$f":"'Indicadores I'!O20","v":369.23076923076923},null,"Aves",{"$f":"'Indicadores I'!Q79","v":477.7034559643256},{"$f":"'Indicadores I'!R79","v":0.98695652173913051},{"$f":"IF(F30>0,SUM(F27+F28+F29+F30),NA())","v":4346.8338907469351},{"$f":"IF(G30>0,SUM(G27+G28+G29+G30),NA())","v":2.9630434782608699},4346.8338907469351,2.9630434782608699,"Aves",2.9630434782608699,4346.8338907469351,null,null,null,null,null,"Suino",1120,7010,null,null,null,"Suino",6710,1120]
["Lavoura Milho e palma",{"$f":"'Indicadores I'!J41","v":-980},{"$f":"'Indicadores I'!O21","v":1180},null,"Lavoura Milho e palma",{"$f":"'Indicadores I'!Q80","v":-54.347826086956523},{"$f":"'Indicadores I'!R80","v":0.21739130434782611},{"$f":"IF(F31>0,SUM(F27+F28+F29+F30+F31),NA())","v":{"$error":"#N/A"}},{"$f":"IF(G31>0,SUM(G27+G28+G29+G30+G31),NA())","v":3.1804347826086961},{"$error":"#N/A"},3.1804347826086961,"Lavoura Milho e palma",3.1804347826086961,{"$error":"#N/A"},null,null,null,null,null,"Ovino",0,180,null,null,null,"Ovino",180,0]
["Quintal - frutas e medicinais",{"$f":"'Indicadores I'!J42","v":0},{"$f":"'Indicadores I'!O22","v":0},null,"Quintal - frutas e medicinais",{"$f":"'Indicadores I'!Q81","v":361.95652173913044},{"$f":"'Indicadores I'!R81","v":3.4782608695652174E-2},{"$f":"IF(F32>0,SUM(F27+F28+F29+F30+F31+F32),NA())","v":4654.4425863991082},{"$f":"IF(G32>0,SUM(G27+G28+G29+G30+G31+G32),NA())","v":3.215217391304348},4654.4425863991082,3.215217391304348,"Quintal - frutas e medicinais",3.215217391304348,4654.4425863991082,null,null,null,null,null,"Aves",369.23076923076923,2197.4358974358975,null,null,null,"Aves",-159.23076923076923,369.23076923076923]
[0,{"$f":"'Indicadores I'!J43","v":0},{"$f":"'Indicadores I'!O23","v":0},null,0,{"$f":"'Indicadores I'!Q82","v":"0"},{"$f":"'Indicadores I'!R82","v":0},{"$f":"IF(F33>0,SUM(F27+F28+F29+F30+F31+F32+F33),NA())","v":4654.4425863991082},{"$f":"IF(G33>0,SUM(G27+G28+G29+G30+G31+G32+G33),NA())","v":{"$error":"#N/A"}},4654.4425863991082,{"$error":"#N/A"},0,{"$error":"#N/A"},4654.4425863991082,null,null,null,null,null,"Lavoura Milho e palma",520,-250,null,null,null,"Lavoura Milho e palma",-980,1180]
[0,{"$f":"'Indicadores I'!J44","v":0},{"$f":"'Indicadores I'!O24","v":0},null,0,{"$f":"'Indicadores I'!Q83","v":"0"},{"$f":"'Indicadores I'!R83","v":0},{"$f":"IF(F34>0,SUM(F27+F28+F29+F30+F31+F32+F33+F34),NA())","v":4654.4425863991082},{"$f":"IF(G34>0,SUM(G27+G28+G29+G30+G31+G32+G33+G34),NA())","v":{"$error":"#N/A"}},4654.4425863991082,{"$error":"#N/A"},0,{"$error":"#N/A"},4654.4425863991082,null,null,null,null,null,"Quintal - frutas e medicinais",0,1665,null,null,null,"Quintal - frutas e medicinais",0,0]
[0,{"$f":"'Indicadores I'!J45","v":0},{"$f":"'Indicadores I'!O25","v":0},null,0,{"$f":"'Indicadores I'!Q84","v":"0"},{"$f":"'Indicadores I'!R84","v":0},{"$f":"IF(F35>0,SUM(F27+F28+F29+F30+F31+F32+F33+F34+F35),NA())","v":4654.4425863991082},{"$f":"IF(G35>0,SUM(G27+G28+G29+G30+G31+G32+G33+G34+G35),NA())","v":{"$error":"#N/A"}},4654.4425863991082,{"$error":"#N/A"},0,{"$error":"#N/A"},4654.4425863991082]
[0,{"$f":"'Indicadores I'!J46","v":0},{"$f":"'Indicadores I'!O26","v":0},null,0,{"$f":"'Indicadores I'!Q85","v":"0"},{"$f":"'Indicadores I'!R85","v":0},{"$f":"IF(F36>0,SUM(F27+F28+F29+F30+F31+F32+F33+F34+F35+F36),NA())","v":4654.4425863991082},{"$f":"IF(G36>0,SUM(G27+G28+G29+G30+G31+G32+G33+G34+G35+G36),NA())","v":{"$error":"#N/A"}},4654.4425863991082,{"$error":"#N/A"},0,{"$error":"#N/A"},4654.4425863991082]
[0,{"$f":"'Indicadores I'!J47","v":0},{"$f":"'Indicadores I'!O27","v":0},null,0,{"$f":"'Indicadores I'!Q86","v":"0"},{"$f":"'Indicadores I'!R86","v":0},{"$f":"IF(F37>0,SUM(F27+F28+F29+F30+F31+F32+F33+F34+F35+F36+F37),NA())","v":4654.4425863991082},{"$f":"IF(G37>0,SUM(G27+G28+G29+G30+G31+G32+G33+G34+G35+G36+G37),NA())","v":{"$error":"#N/A"}},4654.4425863991082,{"$error":"#N/A"},0,{"$error":"#N/A"},4654.4425863991082]
[0,{"$f":"'Indicadores I'!J48","v":0},{"$f":"'Indicadores I'!O28","v":0},null,0,{"$f":"'Indicadores I'!Q87","v":"0"},{"$f":"'Indicadores I'!R87","v":0},{"$f":"IF(F38>0,SUM(F27+F28+F29+F30+F31+F32+F33+F34+F35+F36+F37+F38),NA())","v":4654.4425863991082},{"$f":"IF(G38>0,SUM(G27+G28+G29+G30+G31+G32+G33+G34+G35+G36+G37+G38),NA())","v":{"$error":"#N/A"}},4654.4425863991082,{"$error":"#N/A"},0,{"$error":"#N/A"},4654.4425863991082]
[0,{"$f":"'Indicadores I'!J49","v":1E-4},{"$f":"'Indicadores I'!O29","v":0},null,0,{"$f":"'Indicadores I'!Q88","v":2.173913043478261E-5},{"$f":"'Indicadores I'!R88","v":0},{"$f":"IF(F39>0,SUM(F27+F28+F29+F30+F31+F32+F33+F34+F35+F36+F37+F38+F39),NA())","v":4654.4426081382389},{"$f":"IF(G39>0,SUM(G27+G28+G29+G30+G31+G32+G33+G34+G35+G36+G37+G38+G39),NA())","v":{"$error":"#N/A"}},4654.4426081382389,{"$error":"#N/A"},0,{"$error":"#N/A"},4654.4426081382389]
["Agroecossistema",{"$f":"'Indicadores I'!J51","v":12927.569330769231},{"$f":"'Indicadores I'!O31","v":5729.2307692307695},null,"Agroecossistema",{"$f":"'Indicadores I'!Q89","v":4654.4426081382398},{"$f":"'Indicadores I'!R89","v":1.5217391304347827},{"$f":"IF(F40>0,SUM(F28+F29+F30+F31+F32+F33+F34+F35+F36+F37+F38+F39+F40),NA())","v":7459.3199988851738},{"$f":"IF(G40>0,SUM(G27+G28+G29+G30+G31+G32+G33+G34+G35+G36+G37+G38+G39+G40),NA())","v":4.7369565217391312},7459.3199988851738,null,null,0]
[]
[]
["Composição das Rendas",null,"Estoque","Trocas/Doações","Autocosumo","Venda","CI","VA","CIFT","VAT","CP","RA","RAM","PB"]
["PB","Produto Bruto",null,null,null,null,null,null,null,null,null,null,null,{"$f":"'Indicadores I'!H31","v":40863.224458974357}]
["venda/autoconsumo/estoque","Produto Bruto ",{"$f":"E8","v":15283.557692307693},{"$f":"D8","v":2512.6666666666665},{"$f":"C8","v":4410.2},{"$f":"B8","v":18656.800100000004}]
["Valor agregado bruto/consumos intermediários","Renda Bruta 1",null,null,null,null,{"$f":"I8","v":4169.2307692307695},{"$f":"H8","v":21410.435997435899}]
["Valor agregado territorial/custos intermed. Fora do território","Renda Bruta 2",null,null,null,null,null,null,{"$f":"M8","v":1849.2307692307693},{"$f":"L8","v":23730.435997435899}]
["Renda agrícola/custos produtivos",null,null,null,null,null,null,null,null,null,{"$f":"C26","v":4829.2307692307695},{"$f":"'Indicadores I'!F51","v":19850.435997435899}]
["Renda agricula monetária/custos produtivos","Renda Monetária Bruta",null,null,null,null,null,null,null,null,{"$f":"C26","v":4829.2307692307695},null,{"$f":"B26","v":13827.569330769231}]
[]
["Composição das Rendas/hectáre",null,"Estoque","Trocas/Doações","Autocosumo","Venda","CI","VA","CIFT","VAT","CP","RA","RAM","PB"]
["PB","PB",null,null,null,null,null,null,null,null,null,null,null,{"$f":"'Indicadores I'!H31/B58","v":5837.6034941391936}]
["venda/autoconsumo/estoque","Produto Bruto ",{"$f":"E8/B58","v":2183.3653846153848},{"$f":"D8/B58","v":358.95238095238091},{"$f":"C8/B58","v":630.02857142857135},{"$f":"B8/B58","v":2665.2571571428575}]
["Valor agregado bruto/consumos intermediários","Renda Bruta 1",null,null,null,null,{"$f":"I8/B58","v":595.60439560439568},{"$f":"H8/B58","v":3058.6337139194143}]
["Valor agregado territorial/custos intermed. Fora do território","Renda Bruta 2",null,null,null,null,null,null,{"$f":"M8/B58","v":264.17582417582418},{"$f":"L8/B58","v":3390.0622853479858}]
["Renda agrícola/custos produtivos",null,null,null,null,null,null,null,null,null,{"$f":"K48/B58","v":689.8901098901099},{"$f":"L48/B58","v":2835.7765710622712}]
["Renda agrícola monetária/custos produtivos","Renda Monetária Bruta",null,null,null,null,null,null,null,null,{"$f":"C26/B58","v":689.8901098901099},null,{"$f":"B26/B58","v":1975.3670472527472}]
["Área total do agroecossitema",{"$f":"Agroecossistema!C14","v":7}]
[]
["Subsistemas","VA Autoconsumo Muheres / UTF","VA Autoconsumo Homens/ UTF","VA Mercantil Mulheres/ UTF","VA Mercantil Homens/ UTF"]
[{"$f":"'Indicadores I'!B76","v":"Bovino"},{"$f":"'Indicadores I'!H76","v":10.315175605854973},{"$f":"'Indicadores I'!J76","v":72.582308465834174},{"$f":"'Indicadores I'!L76","v":499.97343580500097},{"$f":"'Indicadores I'!N76","v":3518.0424967000536},null,null,null,null,null,null,null,null,null,null,null,null,null,"Subsistemas"]
[{"$f":"'Indicadores I'!B77","v":"Suino"},{"$f":"'Indicadores I'!H77","v":217.13299693994782},{"$f":"'Indicadores I'!J77","v":187.3147328440472},{"$f":"'Indicadores I'!L77","v":1889.0570733775462},{"$f":"'Indicadores I'!N77","v":1629.6381757432107},null,null,null,null,null,null,null,null,null,null,null,null,"Dados",0,"Bovino","Suino","Ovino","Aves","Lavoura Milho e palma","Quintal - frutas e medicinais","Total Geral"]
[{"$f":"'Indicadores I'!B78","v":"Ovino"},{"$f":"'Indicadores I'!H78","v":""},{"$f":"'Indicadores I'!J78","v":""},{"$f":"'Indicadores I'!L78","v":41.53846153846154},{"$f":"'Indicadores I'!N78","v":36},null,null,null,null,null,null,null,null,null,null,null,null,"Mulheres.",{"$error":"#DIV/0!"},493.50927525745158,1590.2158309688562,41.53846153846154,81.043473561914027,-33.064930615041973,0,{"$error":"#DIV/0!"}]
[{"$f":"'Indicadores I'!B79","v":"Aves"},{"$f":"'Indicadores I'!H79","v":764.12417929804644},{"$f":"'Indicadores I'!J79","v":0},{"$f":"'Indicadores I'!L79","v":81.043473561914027},{"$f":"'Indicadores I'!N79","v":0},null,null,null,null,null,null,null,null,null,null,null,null,"Homens.",{"$error":"#DIV/0!"},3472.5576971423425,1371.8359610938705,36,0,-57.015590200445438,0,{"$error":"#DIV/0!"}]
[{"$f":"'Indicadores I'!B80","v":"Lavoura Milho e palma"},{"$f":"'Indicadores I'!H80","v":-8.2662326537604933},{"$f":"'Indicadores I'!J80","v":-14.253897550111359},{"$f":"'Indicadores I'!L80","v":-33.064930615041973},{"$f":"'Indicadores I'!N80","v":-57.015590200445438}]
[{"$f":"'Indicadores I'!B81","v":"Quintal - frutas e medicinais"},{"$f":"'Indicadores I'!H81","v":631.73076923076917},{"$f":"'Indicadores I'!J81","v":11.25},{"$f":"'Indicadores I'!L81","v":""},{"$f":"'Indicadores I'!N81","v":""}]
[{"$f":"'Indicadores I'!B82","v":0},{"$f":"'Indicadores I'!H82","v":""},{"$f":"'Indicadores I'!J82","v":""},{"$f":"'Indicadores I'!L82","v":""},{"$f":"'Indicadores I'!N82","v":""}]
[{"$f":"'Indicadores I'!B83","v":0},{"$f":"'Indicadores I'!H83","v":""},{"$f":"'Indicadores I'!J83","v":""},{"$f":"'Indicadores I'!L83","v":""},{"$f":"'Indicadores I'!N83","v":""}]
[{"$f":"'Indicadores I'!B84","v":0},{"$f":"'Indicadores I'!H84","v":""},{"$f":"'Indicadores I'!J84","v":""},{"$f":"'Indicadores I'!L84","v":""},{"$f":"'Indicadores I'!N84","v":""}]
[{"$f":"'Indicadores I'!B85","v":0},{"$f":"'Indicadores I'!H85","v":""},{"$f":"'Indicadores I'!J85","v":""},{"$f":"'Indicadores I'!L85","v":""},{"$f":"'Indicadores I'!N85","v":""},null,null,null,null,null,null,null,null,null,null,null,null,"VA Autoconsumo"]
[{"$f":"'Indicadores I'!B86","v":0},{"$f":"'Indicadores I'!H86","v":""},{"$f":"'Indicadores I'!J86","v":""},{"$f":"'Indicadores I'!L86","v":""},{"$f":"'Indicadores I'!N86","v":""},null,null,null,null,null,null,null,null,null,null,null,null,null,"Subsistemas"]
[{"$f":"'Indicadores I'!B87","v":0},{"$f":"'Indicadores I'!H87","v":""},{"$f":"'Indicadores I'!J87","v":""},{"$f":"'Indicadores I'!L87","v":""},{"$f":"'Indicadores I'!N87","v":""},null,null,null,null,null,null,null,null,null,null,null,null,"Dados",0,"Bovino","Suino","Ovino","Aves","Lavoura Milho e palma","Quintal - frutas e medicinais","Total Geral"]
[{"$f":"'Indicadores I'!B88","v":0},{"$f":"'Indicadores I'!H88","v":""},{"$f":"'Indicadores I'!J88","v":""},{"$f":"'Indicadores I'!L88","v":{"$error":"#DIV/0!"}},{"$f":"'Indicadores I'!N88","v":{"$error":"#DIV/0!"}},null,null,null,null,null,null,null,null,null,null,null,null,"Muheres.",0,10.181810618003064,30.463904807832492,0,764.12417929804644,-8.2662326537604933,631.73076923076917,1428.2344313008907]
[{"$f":"'Indicadores I'!B89","v":"Agroecossistema"},{"$f":"'Indicadores I'!H89","v":1615.0368884208578},{"$f":"'Indicadores I'!J89","v":256.89314375977006},{"$f":"'Indicadores I'!L89","v":{"$error":"#DIV/0!"}},{"$f":"'Indicadores I'!N89","v":{"$error":"#DIV/0!"}},null,null,null,null,null,null,null,null,null,null,null,null,"Homens.",0,71.643891219566925,26.280382396434298,0,0,-14.253897550111359,11.25,94.920376065889855]
[]
[null,null,null,null,"Intensidade do Trabalho VA/HT",null,null,null,"Intensidade do Uso de Terra Area/VA",null,null,"Intensidade do Uso de Terra Area/VA convertido em 1 há",null,null,"Intensidade do Uso de Terra Area/VA"]
[null,"VA","HT","Àrea",null,"HT","VA","HT",null,"Area","VA",null,"Area/Area total","VA/Area Total",null,"Area / há","Va"]
["Agroecossitema",0,0,null,{"$f":"A78","v":"Agroecossitema"},{"$f":"H78","v":0},{"$f":"B78","v":0},{"$f":"C78","v":0},{"$f":"E78","v":"Agroecossitema"},0,{"$f":"G78","v":0},{"$f":"A78","v":"Agroecossitema"},null,null,{"$f":"A78","v":"Agroecossitema"},0,0]
[{"$f":"'Indicadores I'!B76","v":"Bovino"},{"$f":"'Indicadores I'!D37","v":8508.0000000000018},{"$f":"'Indicadores I'!C57","v":3368.25},{"$f":"'Indicadores I'!C17","v":4.54},{"$f":"A79","v":"Bovino"},{"$f":"H79","v":3368.25},{"$f":"B79","v":8508.0000000000018},{"$f":"C79","v":3368.25},{"$f":"E79","v":"Bovino"},{"$f":"D79","v":4.54},{"$f":"G79","v":8508.0000000000018},{"$f":"A79","v":"Bovino"},{"$f":"D79/$D$92","v":0.30696416497633539},{"$f":"B79/$D$92","v":575.2535496957405},{"$f":"A79","v":"Bovino"},{"$f":"M79","v":0.30696416497633539},{"$f":"N79","v":575.2535496957405},null,null,null,"Subsistemas"]
[{"$f":"'Indicadores I'!B77","v":"Suino"},{"$f":"'Indicadores I'!D38","v":9110},{"$f":"'Indicadores I'!C58","v":451.25},{"$f":"'Indicadores I'!C18","v":0.01},{"$f":"A80","v":"Suino"},3819.5,{"$f":"IF(B80>0,SUM(B$79:B80),NA())","v":17618},{"$f":"IF(C80>0,SUM(C$79:C80),NA())","v":3819.5},"Suino",{"$f":"IF(D80>0,SUM(D$79:D80),NA())","v":4.55},17618,"Suino",{"$f":"D80/$D$92","v":6.7613252197430706E-4},{"$f":"B80/$D$92","v":615.95672751859365},"Suino",{"$f":"IF(M80>0,SUM(M$79:M80),NA())","v":0.30764029749830968},{"$f":"IF(N80>0,SUM(N$79:N80),NA())","v":1191.2102772143342},null,null,"Dados",0,"Bovino","Suino","Ovino","Aves","Lavoura Milho e palma","Quintal - frutas e medicinais"]
[{"$f":"'Indicadores I'!B78","v":"Ovino"},{"$f":"'Indicadores I'!D39","v":180},{"$f":"'Indicadores I'!C59","v":456.25},{"$f":"'Indicadores I'!C19","v":4.54},{"$f":"A81","v":"Ovino"},4275.75,{"$f":"IF(B81>0,SUM(B$79:B81),NA())","v":17798},{"$f":"IF(C81>0,SUM(C$79:C81),NA())","v":4275.75},"Ovino",{"$f":"IF(D81>0,SUM(D$79:D81),NA())","v":9.09},17798,"Ovino",0.30696416497633539,12.170385395537526,"Ovino",{"$f":"IF(M81>0,SUM(M$79:M81),NA())","v":0.61460446247464506},{"$f":"IF(N81>0,SUM(N$79:N81),NA())","v":1203.3806626098717},null,null," VA Autoconsumo Muheres / UTF",0,10.181810618003064,30.463904807832492,0,764.12417929804644,-8.2662326537604933,631.73076923076917]
[{"$f":"'Indicadores I'!B79","v":"Aves"},{"$f":"'Indicadores I'!D40","v":2197.4358974358975},{"$f":"'Indicadores I'!C60","v":456.25},{"$f":"'Indicadores I'!C20","v":4.54},{"$f":"A82","v":"Aves"},4732,{"$f":"IF(B82>0,SUM(B$79:B82),NA())","v":19995.435897435898},{"$f":"IF(C82>0,SUM(C$79:C82),NA())","v":4732},"Aves",{"$f":"IF(D82>0,SUM(D$79:D82),NA())","v":13.629999999999999},19995.435897435898,"Aves",0.30696416497633539,148.5757875210208,"Aves",{"$f":"IF(M82>0,SUM(M$79:M82),NA())","v":0.92156862745098045},{"$f":"IF(N82>0,SUM(N$79:N82),NA())","v":1351.9564501308926},null,null,"VA Autoconsumo Homens/ UTF.",0,71.643891219566925,26.280382396434298,0,0,-14.253897550111359,11.25]
[{"$f":"'Indicadores I'!B80","v":"Lavoura Milho e palma"},{"$f":"'Indicadores I'!D41","v":-250},{"$f":"'Indicadores I'!C61","v":3367.5},{"$f":"'Indicadores I'!C21","v":1},{"$f":"A83","v":"Lavoura Milho e palma"},8099.5,{"$f":"IF(B83>0,SUM(B$79:B83),NA())","v":{"$error":"#N/A"}},{"$f":"IF(C83>0,SUM(C$79:C83),NA())","v":8099.5},"Lavoura Milho e palma",{"$f":"IF(D83>0,SUM(D$79:D83),NA())","v":14.629999999999999},{"$error":"#N/A"},"Lavoura Milho e palma",6.7613252197430695E-2,-16.903313049357674,"Lavoura Milho e palma",{"$f":"IF(M83>0,SUM(M$79:M83),NA())","v":0.98918187964841109},{"$f":"IF(N83>0,SUM(N$79:N83),NA())","v":{"$error":"#N/A"}},null,null,"VA Mercantil Mulheres/ UTF.",{"$error":"#DIV/0!"},493.50927525745158,1590.2158309688562,41.53846153846154,81.043473561914027,-33.064930615041973,0]
[{"$f":"'Indicadores I'!B81","v":"Quintal - frutas e medicinais"},{"$f":"'Indicadores I'!D42","v":1665},{"$f":"'Indicadores I'!C62","v":444},{"$f":"'Indicadores I'!C22","v":0.16},"Quintal - frutas e medicinais",8543.5,{"$f":"IF(B84>0,SUM(B$79:B84),NA())","v":21410.435897435898},{"$f":"IF(C84>0,SUM(C$79:C84),NA())","v":8543.5},"Quintal - frutas e medicinais",{"$f":"IF(D84>0,SUM(D$79:D84),NA())","v":14.79},21410.435897435898,"Quintal - frutas e medicinais",1.0818120351588913E-2,112.57606490872212,"Quintal - frutas e medicinais",{"$f":"IF(M84>0,SUM(M$79:M84),NA())","v":1},{"$f":"IF(N84>0,SUM(N$79:N84),NA())","v":1447.6292019902571},null,null,"VA Mercantil Homens/ UTF.",{"$error":"#DIV/0!"},3472.5576971423425,1371.8359610938705,36,0,-57.015590200445438,0]
[{"$f":"'Indicadores I'!B82","v":0},{"$f":"'Indicadores I'!D43","v":0},{"$f":"'Indicadores I'!C63","v":0},{"$f":"'Indicadores I'!C23","v":0},0,{"$error":"#N/A"},{"$f":"IF(B85>0,SUM(B$79:B85),NA())","v":{"$error":"#N/A"}},{"$f":"IF(C85>0,SUM(C$79:C85),NA())","v":{"$error":"#N/A"}},0,{"$f":"IF(D85>0,SUM(D$79:D85),NA())","v":{"$error":"#N/A"}},{"$error":"#N/A"},0,0,0,0,{"$f":"IF(M85>0,SUM(M$79:M85),NA())","v":{"$error":"#N/A"}},{"$f":"IF(N85>0,SUM(N$79:N85),NA())","v":{"$error":"#N/A"}}]
[{"$f":"'Indicadores I'!B83","v":0},{"$f":"'Indicadores I'!D44","v":0},{"$f":"'Indicadores I'!C64","v":0},{"$f":"'Indicadores I'!C24","v":0},0,{"$error":"#N/A"},{"$f":"IF(B86>0,SUM(B$79:B86),NA())","v":{"$error":"#N/A"}},{"$f":"IF(C86>0,SUM(C$79:C86),NA())","v":{"$error":"#N/A"}},0,{"$f":"IF(D86>0,SUM(D$79:D86),NA())","v":{"$error":"#N/A"}},{"$error":"#N/A"},0,0,0,0,{"$f":"IF(M86>0,SUM(M$79:M86),NA())","v":{"$error":"#N/A"}},{"$f":"IF(N86>0,SUM(N$79:N86),NA())","v":{"$error":"#N/A"}}]
[{"$f":"'Indicadores I'!B84","v":0},{"$f":"'Indicadores I'!D45","v":0},{"$f":"'Indicadores I'!C65","v":0},{"$f":"'Indicadores I'!C25","v":0},0,{"$error":"#N/A"},{"$f":"IF(B87>0,SUM(B$79:B87),NA())","v":{"$error":"#N/A"}},{"$f":"IF(C87>0,SUM(C$79:C87),NA())","v":{"$error":"#N/A"}},0,{"$f":"IF(D87>0,SUM(D$79:D87),NA())","v":{"$error":"#N/A"}},{"$error":"#N/A"},0,0,0,0,{"$f":"IF(M87>0,SUM(M$79:M87),NA())","v":{"$error":"#N/A"}},{"$f":"IF(N87>0,SUM(N$79:N87),NA())","v":{"$error":"#N/A"}}]
[{"$f":"'Indicadores I'!B85","v":0},{"$f":"'Indicadores I'!D46","v":0},{"$f":"'Indicadores I'!C66","v":0},{"$f":"'Indicadores I'!C26","v":0},0,{"$error":"#N/A"},{"$f":"IF(B88>0,SUM(B$79:B88),NA())","v":{"$error":"#N/A"}},{"$f":"IF(C88>0,SUM(C$79:C88),NA())","v":{"$error":"#N/A"}},0,{"$f":"IF(D88>0,SUM(D$79:D88),NA())","v":{"$error":"#N/A"}},{"$error":"#N/A"},0,0,0,0,{"$f":"IF(M88>0,SUM(M$79:M88),NA())","v":{"$error":"#N/A"}},{"$f":"IF(N88>0,SUM(N$79:N88),NA())","v":{"$error":"#N/A"}}]
[{"$f":"'Indicadores I'!B86","v":0},{"$f":"'Indicadores I'!D47","v":0},{"$f":"'Indicadores I'!C67","v":0},{"$f":"'Indicadores I'!C27","v":0},0,{"$error":"#N/A"},{"$f":"IF(B89>0,SUM(B$79:B89),NA())","v":{"$error":"#N/A"}},{"$f":"IF(C89>0,SUM(C$79:C89),NA())","v":{"$error":"#N/A"}},0,{"$f":"IF(D89>0,SUM(D$79:D89),NA())","v":{"$error":"#N/A"}},{"$error":"#N/A"},0,0,0,0,{"$f":"IF(M89>0,SUM(M$79:M89),NA())","v":{"$error":"#N/A"}},{"$f":"IF(N89>0,SUM(N$79:N89),NA())","v":{"$error":"#N/A"}}]
[{"$f":"'Indicadores I'!B87","v":0},{"$f":"'Indicadores I'!D48","v":0},{"$f":"'Indicadores I'!C68","v":0},{"$f":"'Indicadores I'!C28","v":0},0,{"$error":"#N/A"},{"$f":"IF(B90>0,SUM(B$79:B90),NA())","v":{"$error":"#N/A"}},{"$f":"IF(C90>0,SUM(C$79:C90),NA())","v":{"$error":"#N/A"}},0,{"$f":"IF(D90>0,SUM(D$79:D90),NA())","v":{"$error":"#N/A"}},{"$error":"#N/A"},0,0,0,0,{"$f":"IF(M90>0,SUM(M$79:M90),NA())","v":{"$error":"#N/A"}},{"$f":"IF(N90>0,SUM(N$79:N90),NA())","v":{"$error":"#N/A"}}]
[{"$f":"'Indicadores I'!B88","v":0},{"$f":"'Indicadores I'!D49","v":1E-4},{"$f":"'Indicadores I'!C69","v":0},{"$f":"'Indicadores I'!C29","v":0},0,{"$error":"#N/A"},{"$f":"IF(B91>0,SUM(B$79:B91),NA())","v":21410.435997435899},{"$f":"IF(C91>0,SUM(C$79:C91),NA())","v":{"$error":"#N/A"}},0,{"$f":"IF(D91>0,SUM(D$79:D91),NA())","v":{"$error":"#N/A"}},21410.435997435899,0,0,6.7613252197430707E-6,0,{"$f":"IF(M91>0,SUM(M$79:M91),NA())","v":{"$error":"#N/A"}},{"$f":"IF(N91>0,SUM(N$79:N91),NA())","v":1447.6292087515824}]
[{"$f":"'Indicadores I'!B89","v":"Agroecossistema"},{"$f":"'Indicadores I'!D51","v":21410.435997435903},{"$f":"'Indicadores I'!C70","v":8543.5},{"$f":"SUM(D79:D91)","v":14.79},{"$f":"A92","v":"Agroecossistema"},17087,{"$f":"IF(B92>0,SUM(B$79:B92),NA())","v":42820.871994871806},{"$f":"IF(C92>0,SUM(C$79:C92),NA())","v":17087},"Agroecossistema",{"$f":"IF(D92>0,SUM(D$79:D92),NA())","v":29.58},42820.871994871806,"Agroecossistema",null,1447.6292087515824,"Agroecossistema",null,{"$f":"IF(N92>0,SUM(N$79:N92),NA())","v":2895.2584175031648}]

{"sheet":"TG Grau Merc.","index":25,"n_rows":44,"n_cols":16,"rows_kept":44,"cut":false,"hidden":true,"merged":[[1,1,1,15]]}
[]
[null,"Quadro - Gráfico Grau de Mercantilização"]
[]
[]
[]
[null,"Subsistemas","Custos de produção",null,null,"Renda Bruta",null,null,null,"Venda","Total venda","Autoconsumo","Total venda","Insumos produzidos","Total Venda","Trocas e Doações"]
[null,{"$f":"'Indicadores I'!B17","v":"Bovino"},{"$f":"'Indicadores I'!O17","v":2160},null,null,null,null,null,null,{"$f":"'Indicadores I'!D17","v":10236.800000000001},null,{"$f":"'Indicadores I'!E17","v":211.20000000000002},null,{"$f":"'SUB. 1'!$H$57","v":7740},null,{"$f":"'Indicadores I'!F17","v":220.00000000000003}]
[null,{"$f":"'Indicadores I'!B18","v":"Suino"},{"$f":"'Indicadores I'!O18","v":1120},null,null,null,null,null,null,{"$f":"'Indicadores I'!D18","v":7830},null,{"$f":"'Indicadores I'!E18","v":900},null,{"$f":"'SUB. 2'!$H$57","v":0},null,{"$f":"'Indicadores I'!F18","v":1500}]
[null,{"$f":"'Indicadores I'!B19","v":"Ovino"},{"$f":"'Indicadores I'!O19","v":0},null,null,null,null,null,null,{"$f":"'Indicadores I'!D19","v":180},null,{"$f":"'Indicadores I'!E19","v":0},null,{"$f":"'SUB. 3'!$H$57","v":2252.5},null,{"$f":"'Indicadores I'!F19","v":0}]
[null,{"$f":"'Indicadores I'!B20","v":"Aves"},{"$f":"'Indicadores I'!O20","v":369.23076923076923},null,null,null,null,null,null,{"$f":"'Indicadores I'!D20","v":210},null,{"$f":"'Indicadores I'!E20","v":1980},null,{"$f":"'SUB. 4'!$H$57","v":0},null,{"$f":"'Indicadores I'!F20","v":376.66666666666669}]
[null,{"$f":"'Indicadores I'!B21","v":"Lavoura Milho e palma"},{"$f":"'Indicadores I'!O21","v":1180},null,null,null,null,null,null,{"$f":"'Indicadores I'!D21","v":200},null,{"$f":"'Indicadores I'!E21","v":50},null,{"$f":"'SUB. 5'!$H$57","v":63},null,{"$f":"'Indicadores I'!F21","v":20}]
[null,{"$f":"'Indicadores I'!B22","v":"Quintal - frutas e medicinais"},{"$f":"'Indicadores I'!O22","v":0},null,null,null,null,null,null,{"$f":"'Indicadores I'!D22","v":0},null,{"$f":"'Indicadores I'!E22","v":1269},null,{"$f":"'SUB. 6'!$H$57","v":25.2},null,{"$f":"'Indicadores I'!F22","v":396}]
[null,{"$f":"'Indicadores I'!B23","v":0},{"$f":"'Indicadores I'!O23","v":0},null,null,null,null,null,null,{"$f":"'Indicadores I'!D23","v":0},null,{"$f":"'Indicadores I'!E23","v":0},null,{"$f":"'SUB. 7'!$H$57","v":0},null,{"$f":"'Indicadores I'!F23","v":0}]
[null,{"$f":"'Indicadores I'!B24","v":0},{"$f":"'Indicadores I'!O24","v":0},null,null,null,null,null,null,{"$f":"'Indicadores I'!D24","v":0},null,{"$f":"'Indicadores I'!E24","v":0},null,{"$f":"'SUB. 8'!$H$57","v":0},null,{"$f":"'Indicadores I'!F24","v":0}]
[null,{"$f":"'Indicadores I'!B25","v":0},{"$f":"'Indicadores I'!O25","v":0},null,null,null,null,null,null,{"$f":"'Indicadores I'!D25","v":0},null,{"$f":"'Indicadores I'!E25","v":0},null,{"$f":"'SUB. 9'!$H$57","v":0},null,{"$f":"'Indicadores I'!F25","v":0}]
[null,{"$f":"'Indicadores I'!B26","v":0},{"$f":"'Indicadores I'!O26","v":0},null,null,null,null,null,null,{"$f":"'Indicadores I'!D26","v":0},null,{"$f":"'Indicadores I'!E26","v":0},null,{"$f":"'SUB. 10'!$H$57","v":0},null,{"$f":"'Indicadores I'!F26","v":0}]
[null,{"$f":"'Indicadores I'!B27","v":0},{"$f":"'Indicadores I'!O27","v":0},null,null,null,null,null,null,{"$f":"'Indicadores I'!D27","v":0},null,{"$f":"'Indicadores I'!E27","v":0},null,{"$f":"'SUB. 11'!$H$57","v":0},null,{"$f":"'Indicadores I'!F27","v":0}]
[null,{"$f":"'Indicadores I'!B28","v":0},{"$f":"'Indicadores I'!O28","v":0},null,null,null,null,null,null,{"$f":"'Indicadores I'!D28","v":0},null,{"$f":"'Indicadores I'!E28","v":0},null,{"$f":"'SUB. 12'!$H$57","v":0},null,{"$f":"'Indicadores I'!F28","v":0}]
[null,{"$f":"'Indicadores I'!B29","v":0},{"$f":"'Indicadores I'!O29","v":0},null,null,null,null,null,null,{"$f":"'Indicadores I'!D29","v":1E-4},null,{"$f":"'Indicadores I'!E29","v":0},null,{"$f":"'SUB. Extrativista'!H57","v":0},null,{"$f":"'Indicadores I'!F29","v":0}]
[null,{"$f":"'Indicadores I'!B30","v":"Custos Sistêmicos"},{"$f":"'Indicadores I'!O30","v":900},null,null,{"$f":"K20","v":25579.666766666673},null,null,null,null,{"$f":"'Indicadores I'!C51","v":25579.666766666673},null,{"$f":"K20","v":25579.666766666673},null,{"$f":"K20","v":25579.666766666673}]
[null,null,null,null,null,null,null,null,null,null,null,null,null,{"$f":"SUM(N7:N20)","v":10080.700000000001},"total"]
[]
[]
[]
[]
[]
[]
[]
[]
[]
[]
[null,null,null,null,null,null,null,null,null,null,{"$f":"'Indicadores I'!J37","v":8076.8000000000011}]
[null,null,null,null,null,null,null,null,null,null,{"$f":"'Indicadores I'!J38","v":6710}]
[null,null,null,null,null,null,null,null,null,null,{"$f":"'Indicadores I'!J39","v":180}]
[null,null,null,null,null,null,null,null,null,null,{"$f":"'Indicadores I'!J40","v":-159.23076923076923}]
[null,null,null,null,null,null,null,null,null,null,{"$f":"'Indicadores I'!J41","v":-980}]
[null,null,null,null,null,null,null,null,null,null,{"$f":"'Indicadores I'!J42","v":0}]
[null,null,null,null,null,null,null,null,null,null,{"$f":"'Indicadores I'!J43","v":0}]
[null,null,null,null,null,null,null,null,null,null,{"$f":"'Indicadores I'!J44","v":0}]
[null,null,null,null,null,null,null,null,null,null,{"$f":"'Indicadores I'!J45","v":0}]
[null,null,null,null,null,null,null,null,null,null,{"$f":"'Indicadores I'!J46","v":0}]
[null,null,null,null,null,null,null,null,null,null,{"$f":"'Indicadores I'!J47","v":0}]
[null,null,null,null,null,null,null,null,null,null,{"$f":"'Indicadores I'!J48","v":0}]
[null,null,null,null,null,null,null,null,null,null,{"$f":"'Indicadores I'!J49","v":1E-4}]

{"sheet":"TD ERS","index":26,"n_rows":6,"n_cols":13,"rows_kept":6,"cut":false,"hidden":true,"merged":[]}
[]
[]
[null,"Produtos"]
["Dados",null,"(vazio)","Soro da comunidade","couve","coentro","cebolinha","Leite","porco","Galinhas ","ovo","Millho seco","Total Geral"]
["Entrada serviços e produtos. ",0,null,1825,0,0,0,0,0,0,0,0,1825]
["Doações.",0,null,null,144,144,108,110.00000000000001,150,360,16.666666666666668,20,1052.6666666666667]

{"sheet":"TD ERS para Diagrama","index":27,"n_rows":6,"n_cols":13,"rows_kept":6,"cut":false,"hidden":true,"merged":[]}
[]
[]
[null,"Rótulos de Coluna"]
["Valores",null,"(vazio)","Soro da comunidade","couve","coentro","cebolinha","Leite","porco","Galinhas ","ovo","Millho seco","Total Geral"]
["Soma de Entrada serviços e produtos ",0,null,1825,0,0,0,0,0,0,0,0,1825]
["Soma de Renda Bruta",null,23369.666766666673,null,null,null,null,null,null,null,null,null,23369.666766666673]

{"sheet":"Tabela ERS","index":28,"n_rows":434,"n_cols":5,"rows_kept":434,"cut":false,"hidden":true,"merged":[[404,0,418,0],[419,0,433,0],[1,1,1,6],[299,0,313,0],[314,0,328,0],[329,0,343,0],[344,0,358,0],[359,0,373,0],[374,0,388,0],[221,0,238,0],[239,0,253,0],[254,0,268,0],[269,0,283,0],[284,0,298,0],[389,0,403,0],[113,0,130,0],[131,0,148,0],[149,0,166,0],[167,0,184,0],[185,0,202,0],[203,0,220,0],[95,0,112,0],[5,0,22,0],[23,0,40,0],[41,0,58,0],[59,0,76,0],[77,0,94,0]]}
[]
[null,"Tabelas Dinâmicas de composição do  gráfico ER-Social"]
[]
[null,"Produtos","Doações","Entrada serviços e produtos ","Recda Bruta"]
[null,null,null,null,{"$f":"'Indicadores I'!C51","v":25579.666766666673}]
["SUBSISTEMA 1",{"$f":"IF(C6=0,\"\",'SUB. 1'!B19)","v":"Leite"},{"$f":"'SUB. 1'!L19","v":220.00000000000003},{"$f":"N6","v":0}]
[null,{"$f":"IF(C7=0,\"\",'SUB. 1'!B20)","v":""},{"$f":"'SUB. 1'!L20","v":0},{"$f":"N7","v":0}]
[null,{"$f":"IF(C8=0,\"\",'SUB. 1'!B21)","v":""},{"$f":"'SUB. 1'!L21","v":0},0]
[null,{"$f":"IF(C9=0,\"\",'SUB. 1'!B22)","v":""},{"$f":"'SUB. 1'!L22","v":0},0]
[null,{"$f":"IF(C10=0,\"\",'SUB. 1'!B23)","v":""},{"$f":"'SUB. 1'!L23","v":0},0]
[null,{"$f":"IF(C11=0,\"\",'SUB. 1'!B24)","v":""},{"$f":"'SUB. 1'!L24","v":0},0]
[null,{"$f":"IF(C12=0,\"\",'SUB. 1'!B25)","v":""},{"$f":"'SUB. 1'!L25","v":0},0]
[null,{"$f":"IF(C13=0,\"\",'SUB. 1'!B26)","v":""},{"$f":"'SUB. 1'!L26","v":0},0]
[null,{"$f":"IF(C14=0,\"\",'SUB. 1'!B27)","v":""},{"$f":"'SUB. 1'!L27","v":0},0]
[null,{"$f":"IF(C15=0,\"\",'SUB. 1'!B28)","v":""},{"$f":"'SUB. 1'!L28","v":0},0]
[null,{"$f":"IF(C16=0,\"\",'SUB. 1'!B29)","v":""},{"$f":"'SUB. 1'!L29","v":0},0]
[null,{"$f":"IF(C17=0,\"\",'SUB. 1'!B30)","v":""},{"$f":"'SUB. 1'!L30","v":0},0]
[null,{"$f":"IF(C18=0,\"\",'SUB. 1'!B31)","v":""},{"$f":"'SUB. 1'!L31","v":0},0]
[null,{"$f":"IF(C19=0,\"\",'SUB. 1'!B32)","v":""},{"$f":"'SUB. 1'!L32","v":0},0]
[null,{"$f":"IF(C20=0,\"\",'SUB. 1'!B33)","v":""},{"$f":"'SUB. 1'!L33","v":0},0]
[null,{"$f":"IF(C21=0,\"\",'SUB. 1'!B34)","v":""},{"$f":"'SUB. 1'!L34","v":0},0]
[null,{"$f":"IF(C22=0,\"\",'SUB. 1'!B35)","v":""},{"$f":"'SUB. 1'!L35","v":0},0]
[null,{"$f":"IF(C23=0,\"\",'SUB. 1'!B36)","v":""},{"$f":"'SUB. 1'!L36","v":0},0]
["SUBSISTEMA 2",{"$f":"IF(C24=0,\"\",'SUB. 2'!B19)","v":"porco"},{"$f":"'SUB. 2'!L19","v":1500},0]
[null,{"$f":"IF(C25=0,\"\",'SUB. 2'!B20)","v":""},{"$f":"'SUB. 2'!L20","v":0},0]
[null,{"$f":"IF(C26=0,\"\",'SUB. 2'!B21)","v":""},{"$f":"'SUB. 2'!L21","v":0},0]
[null,{"$f":"IF(C27=0,\"\",'SUB. 2'!B22)","v":""},{"$f":"'SUB. 2'!L22","v":0},0]
[null,{"$f":"IF(C28=0,\"\",'SUB. 2'!B23)","v":""},{"$f":"'SUB. 2'!L23","v":0},0]
[null,{"$f":"IF(C29=0,\"\",'SUB. 2'!B24)","v":""},{"$f":"'SUB. 2'!L24","v":0},0]
[null,{"$f":"IF(C30=0,\"\",'SUB. 2'!B25)","v":""},{"$f":"'SUB. 2'!L25","v":0},0]
[null,{"$f":"IF(C31=0,\"\",'SUB. 2'!B26)","v":""},{"$f":"'SUB. 2'!L26","v":0},0]
[null,{"$f":"IF(C32=0,\"\",'SUB. 2'!B27)","v":""},{"$f":"'SUB. 2'!L27","v":0},0]
[null,{"$f":"IF(C33=0,\"\",'SUB. 2'!B28)","v":""},{"$f":"'SUB. 2'!L28","v":0},0]
[null,{"$f":"IF(C34=0,\"\",'SUB. 2'!B29)","v":""},{"$f":"'SUB. 2'!L29","v":0},0]
[null,{"$f":"IF(C35=0,\"\",'SUB. 2'!B30)","v":""},{"$f":"'SUB. 2'!L30","v":0},0]
[null,{"$f":"IF(C36=0,\"\",'SUB. 2'!B31)","v":""},{"$f":"'SUB. 2'!L31","v":0},0]
[null,{"$f":"IF(C37=0,\"\",'SUB. 2'!B32)","v":""},{"$f":"'SUB. 2'!L32","v":0},0]
[null,{"$f":"IF(C38=0,\"\",'SUB. 2'!B33)","v":""},{"$f":"'SUB. 2'!L33","v":0},0]
[null,{"$f":"IF(C39=0,\"\",'SUB. 2'!B34)","v":""},{"$f":"'SUB. 2'!L34","v":0},0]
[null,{"$f":"IF(C40=0,\"\",'SUB. 2'!B35)","v":""},{"$f":"'SUB. 2'!L35","v":0},0]
[null,{"$f":"IF(C41=0,\"\",'SUB. 2'!B36)","v":""},{"$f":"'SUB. 2'!L36","v":0},0]
["SUBSISTEMA 3",{"$f":"IF(C42=0,\"\",'SUB. 3'!B19)","v":""},{"$f":"'SUB. 3'!L19","v":0},0]
[null,{"$f":"IF(C43=0,\"\",'SUB. 3'!B20)","v":""},{"$f":"'SUB. 3'!L20","v":0},0]
[null,{"$f":"IF(C44=0,\"\",'SUB. 3'!B21)","v":""},{"$f":"'SUB. 3'!L21","v":0},0]
[null,{"$f":"IF(C45=0,\"\",'SUB. 3'!B22)","v":""},{"$f":"'SUB. 3'!L22","v":0},0]
[null,{"$f":"IF(C46=0,\"\",'SUB. 3'!B23)","v":""},{"$f":"'SUB. 3'!L23","v":0},0]
[null,{"$f":"IF(C47=0,\"\",'SUB. 3'!B24)","v":""},{"$f":"'SUB. 3'!L24","v":0},0]
[null,{"$f":"IF(C48=0,\"\",'SUB. 3'!B25)","v":""},{"$f":"'SUB. 3'!L25","v":0},0]
[null,{"$f":"IF(C49=0,\"\",'SUB. 3'!B26)","v":""},{"$f":"'SUB. 3'!L26","v":0},0]
[null,{"$f":"IF(C50=0,\"\",'SUB. 3'!B27)","v":""},{"$f":"'SUB. 3'!L27","v":0},0]
[null,{"$f":"IF(C51=0,\"\",'SUB. 3'!B28)","v":""},{"$f":"'SUB. 3'!L28","v":0},0]
[null,{"$f":"IF(C52=0,\"\",'SUB. 3'!B29)","v":""},{"$f":"'SUB. 3'!L29","v":0},0]
[null,{"$f":"IF(C53=0,\"\",'SUB. 3'!B30)","v":""},{"$f":"'SUB. 3'!L30","v":0},0]
[null,{"$f":"IF(C54=0,\"\",'SUB. 3'!B31)","v":""},{"$f":"'SUB. 3'!L31","v":0},0]
[null,{"$f":"IF(C55=0,\"\",'SUB. 3'!B32)","v":""},{"$f":"'SUB. 3'!L32","v":0},0]
[null,{"$f":"IF(C56=0,\"\",'SUB. 3'!B33)","v":""},{"$f":"'SUB. 3'!L33","v":0},0]
[null,{"$f":"IF(C57=0,\"\",'SUB. 3'!B34)","v":""},{"$f":"'SUB. 3'!L34","v":0},0]
[null,{"$f":"IF(C58=0,\"\",'SUB. 3'!B35)","v":""},{"$f":"'SUB. 3'!L35","v":0},0]
[null,{"$f":"IF(C59=0,\"\",'SUB. 3'!B36)","v":""},{"$f":"'SUB. 1'!K48","v":0},0]
["SUBSISTEMA 4",{"$f":"IF(C60=0,\"\",'SUB. 4'!B19)","v":"Galinhas "},{"$f":"'SUB. 4'!L19","v":360},0]
[null,{"$f":"IF(C61=0,\"\",'SUB. 4'!B20)","v":""},{"$f":"'SUB. 4'!L20","v":0},0]
[null,{"$f":"IF(C62=0,\"\",'SUB. 4'!B21)","v":""},{"$f":"'SUB. 4'!L21","v":0},0]
[null,{"$f":"IF(C63=0,\"\",'SUB. 4'!B22)","v":"ovo"},{"$f":"'SUB. 4'!L22","v":16.666666666666668},0]
[null,{"$f":"IF(C64=0,\"\",'SUB. 4'!B23)","v":""},{"$f":"'SUB. 4'!L23","v":0},0]
[null,{"$f":"IF(C65=0,\"\",'SUB. 4'!B24)","v":""},{"$f":"'SUB. 4'!L24","v":0},0]
[null,{"$f":"IF(C66=0,\"\",'SUB. 4'!B25)","v":""},{"$f":"'SUB. 4'!L25","v":0},0]
[null,{"$f":"IF(C67=0,\"\",'SUB. 4'!B26)","v":""},{"$f":"'SUB. 4'!L26","v":0},0]
[null,{"$f":"IF(C68=0,\"\",'SUB. 4'!B27)","v":""},{"$f":"'SUB. 4'!L27","v":0},0]
[null,{"$f":"IF(C69=0,\"\",'SUB. 4'!B28)","v":""},{"$f":"'SUB. 4'!L28","v":0},0]
[null,{"$f":"IF(C70=0,\"\",'SUB. 4'!B29)","v":""},{"$f":"'SUB. 4'!L29","v":0},0]
[null,{"$f":"IF(C71=0,\"\",'SUB. 4'!B30)","v":""},{"$f":"'SUB. 4'!L30","v":0},{"$f":"N71","v":0}]
[null,{"$f":"IF(C72=0,\"\",'SUB. 4'!B31)","v":""},{"$f":"'SUB. 4'!L31","v":0},0]
[null,{"$f":"IF(C73=0,\"\",'SUB. 4'!B32)","v":""},{"$f":"'SUB. 4'!L32","v":0},0]
[null,{"$f":"IF(C74=0,\"\",'SUB. 4'!B33)","v":""},{"$f":"'SUB. 4'!L33","v":0},0]
[null,{"$f":"IF(C75=0,\"\",'SUB. 4'!B34)","v":""},{"$f":"'SUB. 4'!L34","v":0},0]
[null,{"$f":"IF(C76=0,\"\",'SUB. 4'!B35)","v":""},{"$f":"'SUB. 4'!L35","v":0},0]
[null,{"$f":"IF(C77=0,\"\",'SUB. 4'!B36)","v":""},{"$f":"'SUB. 4'!L36","v":0},0]
["SUBSISTEMA 5",{"$f":"IF(C78=0,\"\",'SUB. 5'!B19)","v":""},{"$f":"'SUB. 5'!L19","v":0},0]
[null,{"$f":"IF(C79=0,\"\",'SUB. 5'!B20)","v":"Millho seco"},{"$f":"'SUB. 5'!L20","v":20},0]
[null,{"$f":"IF(C80=0,\"\",'SUB. 5'!B21)","v":""},{"$f":"'SUB. 5'!L21","v":0},0]
[null,{"$f":"IF(C81=0,\"\",'SUB. 5'!B22)","v":""},{"$f":"'SUB. 5'!L22","v":0},0]
[null,{"$f":"IF(C82=0,\"\",'SUB. 5'!B23)","v":""},{"$f":"'SUB. 5'!L23","v":0},0]
[null,{"$f":"IF(C83=0,\"\",'SUB. 5'!B24)","v":""},{"$f":"'SUB. 5'!L24","v":0},0]
[null,{"$f":"IF(C84=0,\"\",'SUB. 5'!B25)","v":""},{"$f":"'SUB. 5'!L25","v":0},0]
[null,{"$f":"IF(C85=0,\"\",'SUB. 5'!B26)","v":""},{"$f":"'SUB. 5'!L26","v":0},0]
[null,{"$f":"IF(C86=0,\"\",'SUB. 5'!B27)","v":""},{"$f":"'SUB. 5'!L27","v":0},0]
[null,{"$f":"IF(C87=0,\"\",'SUB. 5'!B28)","v":""},{"$f":"'SUB. 5'!L28","v":0},0]
[null,{"$f":"IF(C88=0,\"\",'SUB. 5'!B29)","v":""},{"$f":"'SUB. 5'!L29","v":0},0]
[null,{"$f":"IF(C89=0,\"\",'SUB. 5'!B30)","v":""},{"$f":"'SUB. 5'!L30","v":0},0]
[null,{"$f":"IF(C90=0,\"\",'SUB. 5'!B31)","v":""},{"$f":"'SUB. 5'!L31","v":0},0]
[null,{"$f":"IF(C91=0,\"\",'SUB. 5'!B32)","v":""},{"$f":"'SUB. 5'!L32","v":0},0]
[null,{"$f":"IF(C92=0,\"\",'SUB. 5'!B33)","v":""},{"$f":"'SUB. 5'!L33","v":0},0]
[null,{"$f":"IF(C93=0,\"\",'SUB. 5'!B34)","v":""},{"$f":"'SUB. 5'!L34","v":0},0]
[null,{"$f":"IF(C94=0,\"\",'SUB. 5'!B35)","v":""},{"$f":"'SUB. 5'!L35","v":0},0]
[null,{"$f":"IF(C95=0,\"\",'SUB. 5'!B36)","v":""},{"$f":"'SUB. 5'!L36","v":0},0]
["SUBSISTEMA 6",{"$f":"IF(C96=0,\"\",'SUB. 6'!B19)","v":""},{"$f":"'SUB. 6'!L19","v":0},0]
[null,{"$f":"IF(C97=0,\"\",'SUB. 6'!B20)","v":""},{"$f":"'SUB. 6'!L20","v":0},0]
[null,{"$f":"IF(C98=0,\"\",'SUB. 6'!B21)","v":""},{"$f":"'SUB. 6'!L21","v":0},0]
[null,{"$f":"IF(C99=0,\"\",'SUB. 6'!B22)","v":""},{"$f":"'SUB. 6'!L22","v":0},0]
[null,{"$f":"IF(C100=0,\"\",'SUB. 6'!B23)","v":""},{"$f":"'SUB. 6'!L23","v":0},0]
[null,{"$f":"IF(C101=0,\"\",'SUB. 6'!B24)","v":""},{"$f":"'SUB. 6'!L24","v":0},0]
[null,{"$f":"IF(C102=0,\"\",'SUB. 6'!B25)","v":""},{"$f":"'SUB. 6'!L25","v":0},0]
[null,{"$f":"IF(C103=0,\"\",'SUB. 6'!B26)","v":""},{"$f":"'SUB. 6'!L26","v":0},0]
[null,{"$f":"IF(C104=0,\"\",'SUB. 6'!B27)","v":""},{"$f":"'SUB. 6'!L27","v":0},0]
[null,{"$f":"IF(C105=0,\"\",'SUB. 6'!B28)","v":""},{"$f":"'SUB. 6'!L28","v":0},0]
[null,{"$f":"IF(C106=0,\"\",'SUB. 6'!B29)","v":"couve"},{"$f":"'SUB. 6'!L29","v":144},0]
[null,{"$f":"IF(C107=0,\"\",'SUB. 6'!B30)","v":""},{"$f":"'SUB. 6'!L30","v":0},0]
[null,{"$f":"IF(C108=0,\"\",'SUB. 6'!B31)","v":"coentro"},{"$f":"'SUB. 6'!L31","v":144},0]
[null,{"$f":"IF(C109=0,\"\",'SUB. 6'!B32)","v":"cebolinha"},{"$f":"'SUB. 6'!L32","v":108},0]
[null,{"$f":"IF(C110=0,\"\",'SUB. 6'!B33)","v":""},{"$f":"'SUB. 6'!L33","v":0},0]
[null,{"$f":"IF(C111=0,\"\",'SUB. 6'!B34)","v":""},{"$f":"'SUB. 6'!L34","v":0},0]
[null,{"$f":"IF(C112=0,\"\",'SUB. 6'!B35)","v":""},{"$f":"'SUB. 6'!L35","v":0},0]
[null,{"$f":"IF(C113=0,\"\",'SUB. 6'!B36)","v":""},{"$f":"'SUB. 6'!L36","v":0},0]
["SUBSISTEMA 7",{"$f":"IF(C114=0,\"\",'SUB. 7'!B19)","v":""},{"$f":"'SUB. 7'!L19","v":0},0]
[null,{"$f":"IF(C115=0,\"\",'SUB. 7'!B20)","v":""},{"$f":"'SUB. 7'!L20","v":0},0]
[null,{"$f":"IF(C116=0,\"\",'SUB. 7'!B21)","v":""},{"$f":"'SUB. 7'!L21","v":0},0]
[null,{"$f":"IF(C117=0,\"\",'SUB. 7'!B22)","v":""},{"$f":"'SUB. 7'!L22","v":0},0]
[null,{"$f":"IF(C118=0,\"\",'SUB. 7'!B23)","v":""},{"$f":"'SUB. 7'!L23","v":0},0]
[null,{"$f":"IF(C119=0,\"\",'SUB. 7'!B24)","v":""},{"$f":"'SUB. 7'!L24","v":0},0]
[null,{"$f":"IF(C120=0,\"\",'SUB. 7'!B25)","v":""},{"$f":"'SUB. 7'!L25","v":0},0]
[null,{"$f":"IF(C121=0,\"\",'SUB. 7'!B26)","v":""},{"$f":"'SUB. 7'!L26","v":0},0]
[null,{"$f":"IF(C122=0,\"\",'SUB. 7'!B27)","v":""},{"$f":"'SUB. 7'!L27","v":0},0]
[null,{"$f":"IF(C123=0,\"\",'SUB. 7'!B28)","v":""},{"$f":"'SUB. 7'!L28","v":0},0]
[null,{"$f":"IF(C124=0,\"\",'SUB. 7'!B29)","v":""},{"$f":"'SUB. 7'!L29","v":0},0]
[null,{"$f":"IF(C125=0,\"\",'SUB. 7'!B30)","v":""},{"$f":"'SUB. 7'!L30","v":0},0]
[null,{"$f":"IF(C126=0,\"\",'SUB. 7'!B31)","v":""},{"$f":"'SUB. 7'!L31","v":0},0]
[null,{"$f":"IF(C127=0,\"\",'SUB. 7'!B32)","v":""},{"$f":"'SUB. 7'!L32","v":0},0]
[null,{"$f":"IF(C128=0,\"\",'SUB. 7'!B33)","v":""},{"$f":"'SUB. 7'!L33","v":0},0]
[null,{"$f":"IF(C129=0,\"\",'SUB. 7'!B34)","v":""},{"$f":"'SUB. 7'!L34","v":0},0]
[null,{"$f":"IF(C130=0,\"\",'SUB. 7'!B35)","v":""},{"$f":"'SUB. 7'!L35","v":0},0]
[null,{"$f":"IF(C131=0,\"\",'SUB. 7'!B36)","v":""},{"$f":"'SUB. 7'!L36","v":0},0]
["SUBSISTEMA 8",{"$f":"IF(C132=0,\"\",'SUB. 8'!B19)","v":""},{"$f":"'SUB. 8'!L19","v":0},0]
[null,{"$f":"IF(C133=0,\"\",'SUB. 8'!B20)","v":""},{"$f":"'SUB. 8'!L20","v":0},0]
[null,{"$f":"IF(C134=0,\"\",'SUB. 8'!B21)","v":""},{"$f":"'SUB. 8'!L21","v":0},0]
[null,{"$f":"IF(C135=0,\"\",'SUB. 8'!B22)","v":""},{"$f":"'SUB. 8'!L22","v":0},{"$f":"N135","v":0}]
[null,{"$f":"IF(C136=0,\"\",'SUB. 8'!B23)","v":""},{"$f":"'SUB. 8'!L23","v":0},0]
[null,{"$f":"IF(C137=0,\"\",'SUB. 8'!B24)","v":""},{"$f":"'SUB. 8'!L24","v":0},0]
[null,{"$f":"IF(C138=0,\"\",'SUB. 8'!B25)","v":""},{"$f":"'SUB. 8'!L25","v":0},0]
[null,{"$f":"IF(C139=0,\"\",'SUB. 8'!B26)","v":""},{"$f":"'SUB. 8'!L26","v":0},0]
[null,{"$f":"IF(C140=0,\"\",'SUB. 8'!B27)","v":""},{"$f":"'SUB. 8'!L27","v":0},0]
[null,{"$f":"IF(C141=0,\"\",'SUB. 8'!B28)","v":""},{"$f":"'SUB. 8'!L28","v":0},0]
[null,{"$f":"IF(C142=0,\"\",'SUB. 8'!B29)","v":""},{"$f":"'SUB. 8'!L29","v":0},0]
[null,{"$f":"IF(C143=0,\"\",'SUB. 8'!B30)","v":""},{"$f":"'SUB. 8'!L30","v":0},0]
[null,{"$f":"IF(C144=0,\"\",'SUB. 8'!B31)","v":""},{"$f":"'SUB. 8'!L31","v":0},0]
[null,{"$f":"IF(C145=0,\"\",'SUB. 8'!B32)","v":""},{"$f":"'SUB. 8'!L32","v":0},0]
[null,{"$f":"IF(C146=0,\"\",'SUB. 8'!B33)","v":""},{"$f":"'SUB. 8'!L33","v":0},0]
[null,{"$f":"IF(C147=0,\"\",'SUB. 8'!B34)","v":""},{"$f":"'SUB. 8'!L34","v":0},0]
[null,{"$f":"IF(C148=0,\"\",'SUB. 8'!B35)","v":""},{"$f":"'SUB. 8'!L35","v":0},0]
[null,{"$f":"IF(C149=0,\"\",'SUB. 8'!B36)","v":""},{"$f":"'SUB. 8'!L36","v":0},0]
["SUBSISTEMA 9",{"$f":"IF(C150=0,\"\",'SUB. 9'!B19)","v":""},{"$f":"'SUB. 9'!L19","v":0},0]
[null,{"$f":"IF(C151=0,\"\",'SUB. 9'!B20)","v":""},{"$f":"'SUB. 9'!L20","v":0},0]
[null,{"$f":"IF(C152=0,\"\",'SUB. 9'!B21)","v":""},{"$f":"'SUB. 9'!L21","v":0},0]
[null,{"$f":"IF(C153=0,\"\",'SUB. 9'!B22)","v":""},{"$f":"'SUB. 9'!L22","v":0},0]
[null,{"$f":"IF(C154=0,\"\",'SUB. 9'!B23)","v":""},{"$f":"'SUB. 9'!L23","v":0},0]
[null,{"$f":"IF(C155=0,\"\",'SUB. 9'!B24)","v":""},{"$f":"'SUB. 9'!L24","v":0},0]
[null,{"$f":"IF(C156=0,\"\",'SUB. 9'!B25)","v":""},{"$f":"'SUB. 9'!L25","v":0},0]
[null,{"$f":"IF(C157=0,\"\",'SUB. 9'!B26)","v":""},{"$f":"'SUB. 9'!L26","v":0},0]
[null,{"$f":"IF(C158=0,\"\",'SUB. 9'!B27)","v":""},{"$f":"'SUB. 9'!L27","v":0},0]
[null,{"$f":"IF(C159=0,\"\",'SUB. 9'!B28)","v":""},{"$f":"'SUB. 9'!L28","v":0},0]
[null,{"$f":"IF(C160=0,\"\",'SUB. 9'!B29)","v":""},{"$f":"'SUB. 9'!L29","v":0},0]
[null,{"$f":"IF(C161=0,\"\",'SUB. 9'!B30)","v":""},{"$f":"'SUB. 9'!L30","v":0},0]
[null,{"$f":"IF(C162=0,\"\",'SUB. 9'!B31)","v":""},{"$f":"'SUB. 9'!L31","v":0},0]
[null,{"$f":"IF(C163=0,\"\",'SUB. 9'!B32)","v":""},{"$f":"'SUB. 9'!L32","v":0},0]
[null,{"$f":"IF(C164=0,\"\",'SUB. 9'!B33)","v":""},{"$f":"'SUB. 9'!L33","v":0},0]
[null,{"$f":"IF(C165=0,\"\",'SUB. 9'!B34)","v":""},{"$f":"'SUB. 9'!L34","v":0},0]
[null,{"$f":"IF(C166=0,\"\",'SUB. 9'!B35)","v":""},{"$f":"'SUB. 9'!L35","v":0},0]
[null,{"$f":"IF(C167=0,\"\",'SUB. 9'!B36)","v":""},{"$f":"'SUB. 9'!L36","v":0},0]
["SUBSISTEMA 10",{"$f":"IF(C168=0,\"\",'SUB. 10'!B19)","v":""},{"$f":"'SUB. 10'!L19","v":0},0]
[null,{"$f":"IF(C169=0,\"\",'SUB. 10'!B20)","v":""},{"$f":"'SUB. 10'!L20","v":0},0]
[null,{"$f":"IF(C170=0,\"\",'SUB. 10'!B21)","v":""},{"$f":"'SUB. 10'!L21","v":0},0]
[null,{"$f":"IF(C171=0,\"\",'SUB. 10'!B22)","v":""},{"$f":"'SUB. 10'!L22","v":0},0]
[null,{"$f":"IF(C172=0,\"\",'SUB. 10'!B23)","v":""},{"$f":"'SUB. 10'!L23","v":0},0]
[null,{"$f":"IF(C173=0,\"\",'SUB. 10'!B24)","v":""},{"$f":"'SUB. 10'!L24","v":0},0]
[null,{"$f":"IF(C174=0,\"\",'SUB. 10'!B25)","v":""},{"$f":"'SUB. 10'!L25","v":0},0]
[null,{"$f":"IF(C175=0,\"\",'SUB. 10'!B26)","v":""},{"$f":"'SUB. 10'!L26","v":0},0]
[null,{"$f":"IF(C176=0,\"\",'SUB. 10'!B27)","v":""},{"$f":"'SUB. 10'!L27","v":0},0]
[null,{"$f":"IF(C177=0,\"\",'SUB. 10'!B28)","v":""},{"$f":"'SUB. 10'!L28","v":0},0]
[null,{"$f":"IF(C178=0,\"\",'SUB. 10'!B29)","v":""},{"$f":"'SUB. 10'!L29","v":0},0]
[null,{"$f":"IF(C179=0,\"\",'SUB. 10'!B30)","v":""},{"$f":"'SUB. 10'!L30","v":0},0]
[null,{"$f":"IF(C180=0,\"\",'SUB. 10'!B31)","v":""},{"$f":"'SUB. 10'!L31","v":0},0]
[null,{"$f":"IF(C181=0,\"\",'SUB. 10'!B32)","v":""},{"$f":"'SUB. 10'!L32","v":0},0]
[null,{"$f":"IF(C182=0,\"\",'SUB. 10'!B33)","v":""},{"$f":"'SUB. 10'!L33","v":0},0]
[null,{"$f":"IF(C183=0,\"\",'SUB. 10'!B34)","v":""},{"$f":"'SUB. 10'!L34","v":0},0]
[null,{"$f":"IF(C184=0,\"\",'SUB. 10'!B35)","v":""},{"$f":"'SUB. 10'!L35","v":0},0]
[null,{"$f":"IF(C185=0,\"\",'SUB. 10'!B36)","v":""},{"$f":"'SUB. 10'!L36","v":0},0]
["SUBSISTEMA 11",{"$f":"IF(C186=0,\"\",'SUB. 11'!B19)","v":""},{"$f":"'SUB. 11'!L19","v":0},0]
[null,{"$f":"IF(C187=0,\"\",'SUB. 11'!B20)","v":""},{"$f":"'SUB. 11'!L20","v":0},0]
[null,{"$f":"IF(C188=0,\"\",'SUB. 11'!B21)","v":""},{"$f":"'SUB. 11'!L21","v":0},0]
[null,{"$f":"IF(C189=0,\"\",'SUB. 11'!B22)","v":""},{"$f":"'SUB. 11'!L22","v":0},0]
[null,{"$f":"IF(C190=0,\"\",'SUB. 11'!B23)","v":""},{"$f":"'SUB. 11'!L23","v":0},0]
[null,{"$f":"IF(C191=0,\"\",'SUB. 11'!B24)","v":""},{"$f":"'SUB. 11'!L24","v":0},0]
[null,{"$f":"IF(C192=0,\"\",'SUB. 11'!B25)","v":""},{"$f":"'SUB. 11'!L25","v":0},0]
[null,{"$f":"IF(C193=0,\"\",'SUB. 11'!B26)","v":""},{"$f":"'SUB. 11'!L26","v":0},0]
[null,{"$f":"IF(C194=0,\"\",'SUB. 11'!B27)","v":""},{"$f":"'SUB. 11'!L27","v":0},0]
[null,{"$f":"IF(C195=0,\"\",'SUB. 11'!B28)","v":""},{"$f":"'SUB. 11'!L28","v":0},0]
[null,{"$f":"IF(C196=0,\"\",'SUB. 11'!B29)","v":""},{"$f":"'SUB. 11'!L29","v":0},0]
[null,{"$f":"IF(C197=0,\"\",'SUB. 11'!B30)","v":""},{"$f":"'SUB. 11'!L30","v":0},0]
[null,{"$f":"IF(C198=0,\"\",'SUB. 11'!B31)","v":""},{"$f":"'SUB. 11'!L31","v":0},0]
[null,{"$f":"IF(C199=0,\"\",'SUB. 11'!B32)","v":""},{"$f":"'SUB. 11'!L32","v":0},{"$f":"N199","v":0}]
[null,{"$f":"IF(C200=0,\"\",'SUB. 11'!B33)","v":""},{"$f":"'SUB. 11'!L33","v":0},0]
[null,{"$f":"IF(C201=0,\"\",'SUB. 11'!B34)","v":""},{"$f":"'SUB. 11'!L34","v":0},0]
[null,{"$f":"IF(C202=0,\"\",'SUB. 11'!B35)","v":""},{"$f":"'SUB. 11'!L35","v":0},0]
[null,{"$f":"IF(C203=0,\"\",'SUB. 11'!B36)","v":""},{"$f":"'SUB. 11'!L36","v":0},0]
["SUBSISTEMA 12",{"$f":"IF(C204=0,\"\",'SUB. 12'!B19)","v":""},{"$f":"'SUB. 12'!L19","v":0},0]
[null,{"$f":"IF(C205=0,\"\",'SUB. 12'!B20)","v":""},{"$f":"'SUB. 12'!L20","v":0},0]
[null,{"$f":"IF(C206=0,\"\",'SUB. 12'!B21)","v":""},{"$f":"'SUB. 12'!L21","v":0},0]
[null,{"$f":"IF(C207=0,\"\",'SUB. 12'!B22)","v":""},{"$f":"'SUB. 12'!L22","v":0},0]
[null,{"$f":"IF(C208=0,\"\",'SUB. 12'!B23)","v":""},{"$f":"'SUB. 12'!L23","v":0},0]
[null,{"$f":"IF(C209=0,\"\",'SUB. 12'!B24)","v":""},{"$f":"'SUB. 12'!L24","v":0},0]
[null,{"$f":"IF(C210=0,\"\",'SUB. 12'!B25)","v":""},{"$f":"'SUB. 12'!L25","v":0},0]
[null,{"$f":"IF(C211=0,\"\",'SUB. 12'!B26)","v":""},{"$f":"'SUB. 12'!L26","v":0},0]
[null,{"$f":"IF(C212=0,\"\",'SUB. 12'!B27)","v":""},{"$f":"'SUB. 12'!L27","v":0},0]
[null,{"$f":"IF(C213=0,\"\",'SUB. 12'!B28)","v":""},{"$f":"'SUB. 12'!L28","v":0},0]
[null,{"$f":"IF(C214=0,\"\",'SUB. 12'!B29)","v":""},{"$f":"'SUB. 12'!L29","v":0},0]
[null,{"$f":"IF(C215=0,\"\",'SUB. 12'!B30)","v":""},{"$f":"'SUB. 12'!L30","v":0},0]
[null,{"$f":"IF(C216=0,\"\",'SUB. 12'!B31)","v":""},{"$f":"'SUB. 12'!L31","v":0},0]
[null,{"$f":"IF(C217=0,\"\",'SUB. 12'!B32)","v":""},{"$f":"'SUB. 12'!L32","v":0},0]
[null,{"$f":"IF(C218=0,\"\",'SUB. 12'!B33)","v":""},{"$f":"'SUB. 12'!L33","v":0},0]
[null,{"$f":"IF(C219=0,\"\",'SUB. 12'!B34)","v":""},{"$f":"'SUB. 12'!L34","v":0},0]
[null,{"$f":"IF(C220=0,\"\",'SUB. 12'!B35)","v":""},{"$f":"'SUB. 12'!L35","v":0},0]
[null,{"$f":"IF(C221=0,\"\",'SUB. 12'!B36)","v":""},{"$f":"'SUB. 12'!L36","v":0},0]
["SUBSISTEMA 13",{"$f":"IF(C222=0,\"\",'SUB. Extrativista'!B19)","v":""},{"$f":"'SUB. Extrativista'!L19","v":0},0]
[null,{"$f":"IF(C223=0,\"\",'SUB. Extrativista'!B20)","v":""},{"$f":"'SUB. Extrativista'!L20","v":0},0]
[null,{"$f":"IF(C224=0,\"\",'SUB. Extrativista'!B21)","v":""},{"$f":"'SUB. Extrativista'!L21","v":0},0]
[null,{"$f":"IF(C225=0,\"\",'SUB. Extrativista'!B22)","v":""},{"$f":"'SUB. Extrativista'!L22","v":0},0]
[null,{"$f":"IF(C226=0,\"\",'SUB. Extrativista'!B23)","v":""},{"$f":"'SUB. Extrativista'!L23","v":0},0]
[null,{"$f":"IF(C227=0,\"\",'SUB. Extrativista'!B24)","v":""},{"$f":"'SUB. Extrativista'!L24","v":0},0]
[null,{"$f":"IF(C228=0,\"\",'SUB. Extrativista'!B25)","v":""},{"$f":"'SUB. Extrativista'!L25","v":0},0]
[null,{"$f":"IF(C229=0,\"\",'SUB. Extrativista'!B26)","v":""},{"$f":"'SUB. Extrativista'!L26","v":0},0]
[null,{"$f":"IF(C230=0,\"\",'SUB. Extrativista'!B27)","v":""},{"$f":"'SUB. Extrativista'!L27","v":0},0]
[null,{"$f":"IF(C231=0,\"\",'SUB. Extrativista'!B28)","v":""},{"$f":"'SUB. Extrativista'!L28","v":0},0]
[null,{"$f":"IF(C232=0,\"\",'SUB. Extrativista'!B29)","v":""},{"$f":"'SUB. Extrativista'!L29","v":0},0]
[null,{"$f":"IF(C233=0,\"\",'SUB. Extrativista'!B30)","v":""},{"$f":"'SUB. Extrativista'!L30","v":0},0]
[null,{"$f":"IF(C234=0,\"\",'SUB. Extrativista'!B31)","v":""},{"$f":"'SUB. Extrativista'!L31","v":0},0]
[null,{"$f":"IF(C235=0,\"\",'SUB. Extrativista'!B32)","v":""},{"$f":"'SUB. Extrativista'!L32","v":0},0]
[null,{"$f":"IF(C236=0,\"\",'SUB. Extrativista'!B33)","v":""},{"$f":"'SUB. Extrativista'!L33","v":0},0]
[null,{"$f":"IF(C237=0,\"\",'SUB. Extrativista'!B34)","v":""},{"$f":"'SUB. Extrativista'!L34","v":0},0]
[null,{"$f":"IF(C238=0,\"\",'SUB. Extrativista'!B35)","v":""},{"$f":"'SUB. Extrativista'!L35","v":0},0]
[null,{"$f":"IF(C239=0,\"\",'SUB. Extrativista'!B36)","v":""},{"$f":"'SUB. Extrativista'!L36","v":0},0]
["SUBSISTEMA 1",{"$f":"IF(D240=0,\"\",'SUB. 1'!B107)","v":""},null,{"$f":"'SUB. 1'!H107","v":0}]
[null,{"$f":"IF(D241=0,\"\",'SUB. 1'!B108)","v":""},null,{"$f":"'SUB. 1'!H108","v":0}]
[null,{"$f":"IF(D242=0,\"\",'SUB. 1'!B109)","v":""},null,{"$f":"'SUB. 1'!H109","v":0}]
[null,{"$f":"IF(D243=0,\"\",'SUB. 1'!B110)","v":""},null,{"$f":"'SUB. 1'!H110","v":0}]
[null,{"$f":"IF(D244=0,\"\",'SUB. 1'!B111)","v":""},null,{"$f":"'SUB. 1'!H111","v":0}]
[null,{"$f":"IF(D245=0,\"\",'SUB. 1'!B112)","v":""},null,{"$f":"'SUB. 1'!H112","v":0}]
[null,{"$f":"IF(D246=0,\"\",'SUB. 1'!B113)","v":""},null,{"$f":"'SUB. 1'!H113","v":0}]
[null,{"$f":"IF(D247=0,\"\",'SUB. 1'!B114)","v":""},null,{"$f":"'SUB. 1'!H114","v":0}]
[null,{"$f":"IF(D248=0,\"\",'SUB. 1'!B115)","v":""},null,{"$f":"'SUB. 1'!H115","v":0}]
[null,{"$f":"IF(D249=0,\"\",'SUB. 1'!B116)","v":""},null,{"$f":"'SUB. 1'!H116","v":0}]
[null,{"$f":"IF(D250=0,\"\",'SUB. 1'!B117)","v":""},null,{"$f":"'SUB. 1'!H117","v":0}]
[null,{"$f":"IF(D251=0,\"\",'SUB. 1'!B118)","v":""},null,{"$f":"'SUB. 1'!H118","v":0}]
[null,{"$f":"IF(D252=0,\"\",'SUB. 1'!B119)","v":""},null,{"$f":"'SUB. 1'!H119","v":0}]
[null,{"$f":"IF(D253=0,\"\",'SUB. 1'!B120)","v":""},null,{"$f":"'SUB. 1'!H120","v":0}]
[null,{"$f":"IF(D254=0,\"\",'SUB. 1'!B121)","v":""},null,{"$f":"'SUB. 1'!H121","v":0}]
["SUBSISTEMA 2",{"$f":"IF(D255=0,\"\",'SUB. 2'!B107)","v":"Soro da comunidade"},null,{"$f":"'SUB. 2'!H107","v":1825}]
[null,{"$f":"IF(D256=0,\"\",'SUB. 2'!B108)","v":""},null,{"$f":"'SUB. 2'!H108","v":0}]
[null,{"$f":"IF(D257=0,\"\",'SUB. 2'!B109)","v":""},null,{"$f":"'SUB. 2'!H109","v":0}]
[null,{"$f":"IF(D258=0,\"\",'SUB. 2'!B110)","v":""},null,{"$f":"'SUB. 2'!H110","v":0}]
[null,{"$f":"IF(D259=0,\"\",'SUB. 2'!B111)","v":""},null,{"$f":"'SUB. 2'!H111","v":0}]
[null,{"$f":"IF(D260=0,\"\",'SUB. 2'!B112)","v":""},null,{"$f":"'SUB. 2'!H112","v":0}]
[null,{"$f":"IF(D261=0,\"\",'SUB. 2'!B113)","v":""},null,{"$f":"'SUB. 2'!H113","v":0}]
[null,{"$f":"IF(D262=0,\"\",'SUB. 2'!B114)","v":""},null,{"$f":"'SUB. 2'!H114","v":0}]
[null,{"$f":"IF(D263=0,\"\",'SUB. 2'!B115)","v":""},null,{"$f":"'SUB. 2'!H115","v":0}]
[null,{"$f":"IF(D264=0,\"\",'SUB. 2'!B116)","v":""},null,{"$f":"'SUB. 2'!H116","v":0}]
[null,{"$f":"IF(D265=0,\"\",'SUB. 2'!B117)","v":""},null,{"$f":"'SUB. 2'!H117","v":0}]
[null,{"$f":"IF(D266=0,\"\",'SUB. 2'!B118)","v":""},null,{"$f":"'SUB. 2'!H118","v":0}]
[null,{"$f":"IF(D267=0,\"\",'SUB. 2'!B119)","v":""},null,{"$f":"'SUB. 2'!H119","v":0}]
[null,{"$f":"IF(D268=0,\"\",'SUB. 2'!B120)","v":""},null,{"$f":"'SUB. 2'!H120","v":0}]
[null,{"$f":"IF(D269=0,\"\",'SUB. 2'!B121)","v":""},null,{"$f":"'SUB. 2'!H121","v":0}]
["SUBSISTEMA 3",{"$f":"IF(D270=0,\"\",'SUB. 3'!B107)","v":""},null,{"$f":"'SUB. 3'!H107","v":0}]
[null,{"$f":"IF(D271=0,\"\",'SUB. 3'!B108)","v":""},null,{"$f":"'SUB. 3'!H108","v":0}]
[null,{"$f":"IF(D272=0,\"\",'SUB. 3'!B109)","v":""},null,{"$f":"'SUB. 3'!H109","v":0}]
[null,{"$f":"IF(D273=0,\"\",'SUB. 3'!B110)","v":""},null,{"$f":"'SUB. 3'!H110","v":0}]
[null,{"$f":"IF(D274=0,\"\",'SUB. 3'!B111)","v":""},null,{"$f":"'SUB. 3'!H111","v":0}]
[null,{"$f":"IF(D275=0,\"\",'SUB. 3'!B112)","v":""},null,{"$f":"'SUB. 3'!H112","v":0}]
[null,{"$f":"IF(D276=0,\"\",'SUB. 3'!B113)","v":""},null,{"$f":"'SUB. 3'!H113","v":0}]
[null,{"$f":"IF(D277=0,\"\",'SUB. 3'!B114)","v":""},null,{"$f":"'SUB. 3'!H114","v":0}]
[null,{"$f":"IF(D278=0,\"\",'SUB. 3'!B115)","v":""},null,{"$f":"'SUB. 3'!H115","v":0}]
[null,{"$f":"IF(D279=0,\"\",'SUB. 3'!B116)","v":""},null,{"$f":"'SUB. 3'!H116","v":0}]
[null,{"$f":"IF(D280=0,\"\",'SUB. 3'!B117)","v":""},null,{"$f":"'SUB. 3'!H117","v":0}]
[null,{"$f":"IF(D281=0,\"\",'SUB. 3'!B118)","v":""},null,{"$f":"'SUB. 3'!H118","v":0}]
[null,{"$f":"IF(D282=0,\"\",'SUB. 3'!B119)","v":""},null,{"$f":"'SUB. 3'!H119","v":0}]
[null,{"$f":"IF(D283=0,\"\",'SUB. 3'!B120)","v":""},null,{"$f":"'SUB. 3'!H120","v":0}]
[null,{"$f":"IF(D284=0,\"\",'SUB. 3'!B121)","v":""},null,{"$f":"'SUB. 3'!H121","v":0}]
["SUBSISTEMA 4",{"$f":"IF(D285=0,\"\",'SUB. 4'!B107)","v":""},null,{"$f":"'SUB. 4'!H107","v":0}]
[null,{"$f":"IF(D286=0,\"\",'SUB. 4'!B108)","v":""},null,{"$f":"'SUB. 4'!H108","v":0}]
[null,{"$f":"IF(D287=0,\"\",'SUB. 4'!B109)","v":""},null,{"$f":"'SUB. 4'!H109","v":0}]
[null,{"$f":"IF(D288=0,\"\",'SUB. 4'!B110)","v":""},null,{"$f":"'SUB. 4'!H110","v":0}]
[null,{"$f":"IF(D289=0,\"\",'SUB. 4'!B111)","v":""},null,{"$f":"'SUB. 4'!H111","v":0}]
[null,{"$f":"IF(D290=0,\"\",'SUB. 4'!B112)","v":""},null,{"$f":"'SUB. 4'!H112","v":0}]
[null,{"$f":"IF(D291=0,\"\",'SUB. 4'!B113)","v":""},null,{"$f":"'SUB. 4'!H113","v":0}]
[null,{"$f":"IF(D292=0,\"\",'SUB. 4'!B114)","v":""},null,{"$f":"'SUB. 4'!H114","v":0}]
[null,{"$f":"IF(D293=0,\"\",'SUB. 4'!B115)","v":""},null,{"$f":"'SUB. 4'!H115","v":0}]
[null,{"$f":"IF(D294=0,\"\",'SUB. 4'!B116)","v":""},null,{"$f":"'SUB. 4'!H116","v":0}]
[null,{"$f":"IF(D295=0,\"\",'SUB. 4'!B117)","v":""},null,{"$f":"'SUB. 4'!H117","v":0}]
[null,{"$f":"IF(D296=0,\"\",'SUB. 4'!B118)","v":""},null,{"$f":"'SUB. 4'!H118","v":0}]
[null,{"$f":"IF(D297=0,\"\",'SUB. 4'!B119)","v":""},null,{"$f":"'SUB. 4'!H119","v":0}]
[null,{"$f":"IF(D298=0,\"\",'SUB. 4'!B120)","v":""},null,{"$f":"'SUB. 4'!H120","v":0}]
[null,{"$f":"IF(D299=0,\"\",'SUB. 4'!B121)","v":""},null,{"$f":"'SUB. 4'!H121","v":0}]
["SUBSISTEMA 5",{"$f":"IF(D300=0,\"\",'SUB. 5'!B107)","v":""},null,{"$f":"'SUB. 5'!H107","v":0}]
[null,{"$f":"IF(D301=0,\"\",'SUB. 5'!B108)","v":""},null,{"$f":"'SUB. 5'!H108","v":0}]
[null,{"$f":"IF(D302=0,\"\",'SUB. 5'!B109)","v":""},null,{"$f":"'SUB. 5'!H109","v":0}]
[null,{"$f":"IF(D303=0,\"\",'SUB. 5'!B110)","v":""},null,{"$f":"'SUB. 5'!H110","v":0}]
[null,{"$f":"IF(D304=0,\"\",'SUB. 5'!B111)","v":""},null,{"$f":"'SUB. 5'!H111","v":0}]
[null,{"$f":"IF(D305=0,\"\",'SUB. 5'!B112)","v":""},null,{"$f":"'SUB. 5'!H112","v":0}]
[null,{"$f":"IF(D306=0,\"\",'SUB. 5'!B113)","v":""},null,{"$f":"'SUB. 5'!H113","v":0}]
[null,{"$f":"IF(D307=0,\"\",'SUB. 5'!B114)","v":""},null,{"$f":"'SUB. 5'!H114","v":0}]
[null,{"$f":"IF(D308=0,\"\",'SUB. 5'!B115)","v":""},null,{"$f":"'SUB. 5'!H115","v":0}]
[null,{"$f":"IF(D309=0,\"\",'SUB. 5'!B116)","v":""},null,{"$f":"'SUB. 5'!H116","v":0}]
[null,{"$f":"IF(D310=0,\"\",'SUB. 5'!B117)","v":""},null,{"$f":"'SUB. 5'!H117","v":0}]
[null,{"$f":"IF(D311=0,\"\",'SUB. 5'!B118)","v":""},null,{"$f":"'SUB. 5'!H118","v":0}]
[null,{"$f":"IF(D312=0,\"\",'SUB. 5'!B119)","v":""},null,{"$f":"'SUB. 5'!H119","v":0}]
[null,{"$f":"IF(D313=0,\"\",'SUB. 5'!B120)","v":""},null,{"$f":"'SUB. 5'!H120","v":0}]
[null,{"$f":"IF(D314=0,\"\",'SUB. 5'!B121)","v":""},null,{"$f":"'SUB. 5'!H121","v":0}]
["SUBSISTEMA 6",{"$f":"IF(D315=0,\"\",'SUB. 6'!B107)","v":""},null,{"$f":"'SUB. 6'!H107","v":0}]
[null,{"$f":"IF(D316=0,\"\",'SUB. 6'!B108)","v":""},null,{"$f":"'SUB. 6'!H108","v":0}]
[null,{"$f":"IF(D317=0,\"\",'SUB. 6'!B109)","v":""},null,{"$f":"'SUB. 6'!H109","v":0}]
[null,{"$f":"IF(D318=0,\"\",'SUB. 6'!B110)","v":""},null,{"$f":"'SUB. 6'!H110","v":0}]
[null,{"$f":"IF(D319=0,\"\",'SUB. 6'!B111)","v":""},null,{"$f":"'SUB. 6'!H111","v":0}]
[null,{"$f":"IF(D320=0,\"\",'SUB. 6'!B112)","v":""},null,{"$f":"'SUB. 6'!H112","v":0}]
[null,{"$f":"IF(D321=0,\"\",'SUB. 6'!B113)","v":""},null,{"$f":"'SUB. 6'!H113","v":0}]
[null,{"$f":"IF(D322=0,\"\",'SUB. 6'!B114)","v":""},null,{"$f":"'SUB. 6'!H114","v":0}]
[null,{"$f":"IF(D323=0,\"\",'SUB. 6'!B115)","v":""},null,{"$f":"'SUB. 6'!H115","v":0}]
[null,{"$f":"IF(D324=0,\"\",'SUB. 6'!B116)","v":""},null,{"$f":"'SUB. 6'!H116","v":0}]
[null,{"$f":"IF(D325=0,\"\",'SUB. 6'!B117)","v":""},null,{"$f":"'SUB. 6'!H117","v":0}]
[null,{"$f":"IF(D326=0,\"\",'SUB. 6'!B118)","v":""},null,{"$f":"'SUB. 6'!H118","v":0}]
[null,{"$f":"IF(D327=0,\"\",'SUB. 6'!B119)","v":""},null,{"$f":"'SUB. 6'!H119","v":0}]
[null,{"$f":"IF(D328=0,\"\",'SUB. 6'!B120)","v":""},null,{"$f":"'SUB. 6'!H120","v":0}]
[null,{"$f":"IF(D329=0,\"\",'SUB. 6'!B121)","v":""},null,{"$f":"'SUB. 6'!H121","v":0}]
["SUBSISTEMA 7",{"$f":"IF(D330=0,\"\",'SUB. 7'!B107)","v":""},null,{"$f":"'SUB. 7'!H107","v":0}]
[null,{"$f":"IF(D331=0,\"\",'SUB. 7'!B108)","v":""},null,{"$f":"'SUB. 7'!H108","v":0}]
[null,{"$f":"IF(D332=0,\"\",'SUB. 7'!B109)","v":""},null,{"$f":"'SUB. 7'!H109","v":0}]
[null,{"$f":"IF(D333=0,\"\",'SUB. 7'!B110)","v":""},null,{"$f":"'SUB. 7'!H110","v":0}]
[null,{"$f":"IF(D334=0,\"\",'SUB. 7'!B111)","v":""},null,{"$f":"'SUB. 7'!H111","v":0}]
[null,{"$f":"IF(D335=0,\"\",'SUB. 7'!B112)","v":""},null,{"$f":"'SUB. 7'!H112","v":0}]
[null,{"$f":"IF(D336=0,\"\",'SUB. 7'!B113)","v":""},null,{"$f":"'SUB. 7'!H113","v":0}]
[null,{"$f":"IF(D337=0,\"\",'SUB. 7'!B114)","v":""},null,{"$f":"'SUB. 7'!H114","v":0}]
[null,{"$f":"IF(D338=0,\"\",'SUB. 7'!B115)","v":""},null,{"$f":"'SUB. 7'!H115","v":0}]
[null,{"$f":"IF(D339=0,\"\",'SUB. 7'!B116)","v":""},null,{"$f":"'SUB. 7'!H116","v":0}]
[null,{"$f":"IF(D340=0,\"\",'SUB. 7'!B117)","v":""},null,{"$f":"'SUB. 7'!H117","v":0}]
[null,{"$f":"IF(D341=0,\"\",'SUB. 7'!B118)","v":""},null,{"$f":"'SUB. 7'!H118","v":0}]
[null,{"$f":"IF(D342=0,\"\",'SUB. 7'!B119)","v":""},null,{"$f":"'SUB. 7'!H119","v":0}]
[null,{"$f":"IF(D343=0,\"\",'SUB. 7'!B120)","v":""},null,{"$f":"'SUB. 7'!H120","v":0}]
[null,{"$f":"IF(D344=0,\"\",'SUB. 7'!B121)","v":""},null,{"$f":"'SUB. 7'!H121","v":0}]
["SUBSISTEMA 8",{"$f":"IF(D345=0,\"\",'SUB. 8'!B107)","v":""},null,{"$f":"'SUB. 8'!H107","v":0}]
[null,{"$f":"IF(D346=0,\"\",'SUB. 8'!B108)","v":""},null,{"$f":"'SUB. 8'!H108","v":0}]
[null,{"$f":"IF(D347=0,\"\",'SUB. 8'!B109)","v":""},null,{"$f":"'SUB. 8'!H109","v":0}]
[null,{"$f":"IF(D348=0,\"\",'SUB. 8'!B110)","v":""},null,{"$f":"'SUB. 8'!H110","v":0}]
[null,{"$f":"IF(D349=0,\"\",'SUB. 8'!B111)","v":""},null,{"$f":"'SUB. 8'!H111","v":0}]
[null,{"$f":"IF(D350=0,\"\",'SUB. 8'!B112)","v":""},null,{"$f":"'SUB. 8'!H112","v":0}]
[null,{"$f":"IF(D351=0,\"\",'SUB. 8'!B113)","v":""},null,{"$f":"'SUB. 8'!H113","v":0}]
[null,{"$f":"IF(D352=0,\"\",'SUB. 8'!B114)","v":""},null,{"$f":"'SUB. 8'!H114","v":0}]
[null,{"$f":"IF(D353=0,\"\",'SUB. 8'!B115)","v":""},null,{"$f":"'SUB. 8'!H115","v":0}]
[null,{"$f":"IF(D354=0,\"\",'SUB. 8'!B116)","v":""},null,{"$f":"'SUB. 8'!H116","v":0}]
[null,{"$f":"IF(D355=0,\"\",'SUB. 8'!B117)","v":""},null,{"$f":"'SUB. 8'!H117","v":0}]
[null,{"$f":"IF(D356=0,\"\",'SUB. 8'!B118)","v":""},null,{"$f":"'SUB. 8'!H118","v":0}]
[null,{"$f":"IF(D357=0,\"\",'SUB. 8'!B119)","v":""},null,{"$f":"'SUB. 8'!H119","v":0}]
[null,{"$f":"IF(D358=0,\"\",'SUB. 8'!B120)","v":""},null,{"$f":"'SUB. 8'!H120","v":0}]
[null,{"$f":"IF(D359=0,\"\",'SUB. 8'!B121)","v":""},null,{"$f":"'SUB. 8'!H121","v":0}]
["SUBSISTEMA 9",{"$f":"IF(D360=0,\"\",'SUB. 9'!B107)","v":""},null,{"$f":"'SUB. 9'!H107","v":0}]
[null,{"$f":"IF(D361=0,\"\",'SUB. 9'!B108)","v":""},null,{"$f":"'SUB. 9'!H108","v":0}]
[null,{"$f":"IF(D362=0,\"\",'SUB. 9'!B109)","v":""},null,{"$f":"'SUB. 9'!H109","v":0}]
[null,{"$f":"IF(D363=0,\"\",'SUB. 9'!B110)","v":""},null,{"$f":"'SUB. 9'!H110","v":0}]
[null,{"$f":"IF(D364=0,\"\",'SUB. 9'!B111)","v":""},null,{"$f":"'SUB. 9'!H111","v":0}]
[null,{"$f":"IF(D365=0,\"\",'SUB. 9'!B112)","v":""},null,{"$f":"'SUB. 9'!H112","v":0}]
[null,{"$f":"IF(D366=0,\"\",'SUB. 9'!B113)","v":""},null,{"$f":"'SUB. 9'!H113","v":0}]
[null,{"$f":"IF(D367=0,\"\",'SUB. 9'!B114)","v":""},null,{"$f":"'SUB. 9'!H114","v":0}]
[null,{"$f":"IF(D368=0,\"\",'SUB. 9'!B115)","v":""},null,{"$f":"'SUB. 9'!H115","v":0}]
[null,{"$f":"IF(D369=0,\"\",'SUB. 9'!B116)","v":""},null,{"$f":"'SUB. 9'!H116","v":0}]
[null,{"$f":"IF(D370=0,\"\",'SUB. 9'!B117)","v":""},null,{"$f":"'SUB. 9'!H117","v":0}]
[null,{"$f":"IF(D371=0,\"\",'SUB. 9'!B118)","v":""},null,{"$f":"'SUB. 9'!H118","v":0}]
[null,{"$f":"IF(D372=0,\"\",'SUB. 9'!B119)","v":""},null,{"$f":"'SUB. 9'!H119","v":0}]
[null,{"$f":"IF(D373=0,\"\",'SUB. 9'!B120)","v":""},null,{"$f":"'SUB. 9'!H120","v":0}]
[null,{"$f":"IF(D374=0,\"\",'SUB. 9'!B121)","v":""},null,{"$f":"'SUB. 9'!H121","v":0}]
["SUBSISTEMA 10",{"$f":"IF(D375=0,\"\",'SUB. 10'!B107)","v":""},null,{"$f":"'SUB. 10'!H107","v":0}]
[null,{"$f":"IF(D376=0,\"\",'SUB. 10'!B108)","v":""},null,{"$f":"'SUB. 10'!H108","v":0}]
[null,{"$f":"IF(D377=0,\"\",'SUB. 10'!B109)","v":""},null,{"$f":"'SUB. 10'!H109","v":0}]
[null,{"$f":"IF(D378=0,\"\",'SUB. 10'!B110)","v":""},null,{"$f":"'SUB. 10'!H110","v":0}]
[null,{"$f":"IF(D379=0,\"\",'SUB. 10'!B111)","v":""},null,{"$f":"'SUB. 10'!H111","v":0}]
[null,{"$f":"IF(D380=0,\"\",'SUB. 10'!B112)","v":""},null,{"$f":"'SUB. 10'!H112","v":0}]
[null,{"$f":"IF(D381=0,\"\",'SUB. 10'!B113)","v":""},null,{"$f":"'SUB. 10'!H113","v":0}]
[null,{"$f":"IF(D382=0,\"\",'SUB. 10'!B114)","v":""},null,{"$f":"'SUB. 10'!H114","v":0}]
[null,{"$f":"IF(D383=0,\"\",'SUB. 10'!B115)","v":""},null,{"$f":"'SUB. 10'!H115","v":0}]
[null,{"$f":"IF(D384=0,\"\",'SUB. 10'!B116)","v":""},null,{"$f":"'SUB. 10'!H116","v":0}]
[null,{"$f":"IF(D385=0,\"\",'SUB. 10'!B117)","v":""},null,{"$f":"'SUB. 10'!H117","v":0}]
[null,{"$f":"IF(D386=0,\"\",'SUB. 10'!B118)","v":""},null,{"$f":"'SUB. 10'!H118","v":0}]
[null,{"$f":"IF(D387=0,\"\",'SUB. 10'!B119)","v":""},null,{"$f":"'SUB. 10'!H119","v":0}]
[null,{"$f":"IF(D388=0,\"\",'SUB. 10'!B120)","v":""},null,{"$f":"'SUB. 10'!H120","v":0}]
[null,{"$f":"IF(D389=0,\"\",'SUB. 10'!B121)","v":""},null,{"$f":"'SUB. 10'!H121","v":0}]
["SUBSISTEMA 11",{"$f":"IF(D390=0,\"\",'SUB. 11'!B107)","v":""},null,{"$f":"'SUB. 11'!H107","v":0}]
[null,{"$f":"IF(D391=0,\"\",'SUB. 11'!B108)","v":""},null,{"$f":"'SUB. 11'!H108","v":0}]
[null,{"$f":"IF(D392=0,\"\",'SUB. 11'!B109)","v":""},null,{"$f":"'SUB. 11'!H109","v":0}]
[null,{"$f":"IF(D393=0,\"\",'SUB. 11'!B110)","v":""},null,{"$f":"'SUB. 11'!H110","v":0}]
[null,{"$f":"IF(D394=0,\"\",'SUB. 11'!B111)","v":""},null,{"$f":"'SUB. 11'!H111","v":0}]
[null,{"$f":"IF(D395=0,\"\",'SUB. 11'!B112)","v":""},null,{"$f":"'SUB. 11'!H112","v":0}]
[null,{"$f":"IF(D396=0,\"\",'SUB. 11'!B113)","v":""},null,{"$f":"'SUB. 11'!H113","v":0}]
[null,{"$f":"IF(D397=0,\"\",'SUB. 11'!B114)","v":""},null,{"$f":"'SUB. 11'!H114","v":0}]
[null,{"$f":"IF(D398=0,\"\",'SUB. 11'!B115)","v":""},null,{"$f":"'SUB. 11'!H115","v":0}]
[null,{"$f":"IF(D399=0,\"\",'SUB. 11'!B116)","v":""},null,{"$f":"'SUB. 11'!H116","v":0}]
[null,{"$f":"IF(D400=0,\"\",'SUB. 11'!B117)","v":""},null,{"$f":"'SUB. 11'!H117","v":0}]
[null,{"$f":"IF(D401=0,\"\",'SUB. 11'!B118)","v":""},null,{"$f":"'SUB. 11'!H118","v":0}]
[null,{"$f":"IF(D402=0,\"\",'SUB. 11'!B119)","v":""},null,{"$f":"'SUB. 11'!H119","v":0}]
[null,{"$f":"IF(D403=0,\"\",'SUB. 11'!B120)","v":""},null,{"$f":"'SUB. 11'!H120","v":0}]
[null,{"$f":"IF(D404=0,\"\",'SUB. 11'!B121)","v":""},null,{"$f":"'SUB. 11'!H121","v":0}]
["SUBSISTEMA 12",{"$f":"IF(D405=0,\"\",'SUB. 12'!B2107)","v":""},null,{"$f":"'SUB. 12'!H107","v":0}]
[null,{"$f":"IF(D406=0,\"\",'SUB. 12'!B2108)","v":""},null,{"$f":"'SUB. 12'!H108","v":0}]
[null,{"$f":"IF(D407=0,\"\",'SUB. 12'!B2109)","v":""},null,{"$f":"'SUB. 12'!H109","v":0}]
[null,{"$f":"IF(D408=0,\"\",'SUB. 12'!B2110)","v":""},null,{"$f":"'SUB. 12'!H110","v":0}]
[null,{"$f":"IF(D409=0,\"\",'SUB. 12'!B2111)","v":""},null,{"$f":"'SUB. 12'!H111","v":0}]
[null,{"$f":"IF(D410=0,\"\",'SUB. 12'!B2112)","v":""},null,{"$f":"'SUB. 12'!H112","v":0}]
[null,{"$f":"IF(D411=0,\"\",'SUB. 12'!B2113)","v":""},null,{"$f":"'SUB. 12'!H113","v":0}]
[null,{"$f":"IF(D412=0,\"\",'SUB. 12'!B2114)","v":""},null,{"$f":"'SUB. 12'!H114","v":0}]
[null,{"$f":"IF(D413=0,\"\",'SUB. 12'!B2115)","v":""},null,{"$f":"'SUB. 12'!H115","v":0}]
[null,{"$f":"IF(D414=0,\"\",'SUB. 12'!B2116)","v":""},null,{"$f":"'SUB. 12'!H116","v":0}]
[null,{"$f":"IF(D415=0,\"\",'SUB. 12'!B2117)","v":""},null,{"$f":"'SUB. 12'!H117","v":0}]
[null,{"$f":"IF(D416=0,\"\",'SUB. 12'!B2118)","v":""},null,{"$f":"'SUB. 12'!H118","v":0}]
[null,{"$f":"IF(D417=0,\"\",'SUB. 12'!B2119)","v":""},null,{"$f":"'SUB. 12'!H119","v":0}]
[null,{"$f":"IF(D418=0,\"\",'SUB. 12'!B2120)","v":""},null,{"$f":"'SUB. 12'!H120","v":0}]
[null,{"$f":"IF(D419=0,\"\",'SUB. 12'!B2121)","v":""},null,{"$f":"'SUB. 12'!H121","v":0}]
["SUBSISTEMA 13",{"$f":"IF(D420=0,\"\",'SUB. Extrativista'!B107)","v":""},null,{"$f":"'SUB. Extrativista'!H107","v":0}]
[null,{"$f":"IF(D421=0,\"\",'SUB. Extrativista'!B108)","v":""},null,{"$f":"'SUB. Extrativista'!H108","v":0}]
[null,{"$f":"IF(D422=0,\"\",'SUB. Extrativista'!B109)","v":""},null,{"$f":"'SUB. Extrativista'!H109","v":0}]
[null,{"$f":"IF(D423=0,\"\",'SUB. Extrativista'!B110)","v":""},null,{"$f":"'SUB. Extrativista'!H110","v":0}]
[null,{"$f":"IF(D424=0,\"\",'SUB. Extrativista'!B111)","v":""},null,{"$f":"'SUB. Extrativista'!H111","v":0}]
[null,{"$f":"IF(D425=0,\"\",'SUB. Extrativista'!B112)","v":""},null,{"$f":"'SUB. Extrativista'!H112","v":0}]
[null,{"$f":"IF(D426=0,\"\",'SUB. Extrativista'!B113)","v":""},null,{"$f":"'SUB. Extrativista'!H113","v":0}]
[null,{"$f":"IF(D427=0,\"\",'SUB. Extrativista'!B114)","v":""},null,{"$f":"'SUB. Extrativista'!H114","v":0}]
[null,{"$f":"IF(D428=0,\"\",'SUB. Extrativista'!B115)","v":""},null,{"$f":"'SUB. Extrativista'!H115","v":0}]
[null,{"$f":"IF(D429=0,\"\",'SUB. Extrativista'!B116)","v":""},null,{"$f":"'SUB. Extrativista'!H116","v":0}]
[null,{"$f":"IF(D430=0,\"\",'SUB. Extrativista'!B117)","v":""},null,{"$f":"'SUB. Extrativista'!H117","v":0}]
[null,{"$f":"IF(D431=0,\"\",'SUB. Extrativista'!B118)","v":""},null,{"$f":"'SUB. Extrativista'!H118","v":0}]
[null,{"$f":"IF(D432=0,\"\",'SUB. Extrativista'!B119)","v":""},null,{"$f":"'SUB. Extrativista'!H119","v":0}]
[null,{"$f":"IF(D433=0,\"\",'SUB. Extrativista'!B120)","v":""},null,{"$f":"'SUB. Extrativista'!H120","v":0}]
[null,{"$f":"IF(D434=0,\"\",'SUB. Extrativista'!B121)","v":""},null,{"$f":"'SUB. Extrativista'!H121","v":0}]

{"sheet":"Tabela Produções","index":29,"n_rows":238,"n_cols":22,"rows_kept":238,"cut":false,"hidden":true,"merged":[[220,0,237,0],[166,0,183,0],[148,0,165,0],[202,0,219,0],[184,0,201,0],[1,9,1,17],[4,0,21,0],[22,0,39,0],[130,0,147,0],[112,0,129,0],[94,0,111,0],[76,0,93,0],[58,0,75,0],[40,0,57,0]]}
[]
[null,null,null,null,null,null,null,null,null,"Tabelas Dinâmicas de composição dos  gráficos 2"]
[]
[null,"Produtos 1","Produções","Produtos 2","Venda","Produtos 3","Autoconsumo","Doações trocas","Estoque","Insumos Produzidos"]
["SUBSISTEMA 1",{"$f":"IF(C5=0,\"\",'SUB. 1'!B19)","v":"Leite"},{"$f":"'SUB. 1'!P19","v":8668},{"$f":"IF(E5=0,\"\",'SUB. 1'!B19)","v":"Leite"},{"$f":"'SUB. 1'!H19","v":8236.8000000000011},{"$f":"IF(G5=0,\"\",'SUB. 1'!B19)","v":"Leite"},{"$f":"'SUB. 1'!J19","v":211.20000000000002},{"$f":"'SUB. 1'!L19","v":220.00000000000003},{"$f":"'SUB. 1'!N19","v":0},{"$f":"'SUB. 1'!R19","v":0}]
[null,{"$f":"IF(C6=0,\"\",'SUB. 1'!B20)","v":"vaca (4)"},{"$f":"'SUB. 1'!P20","v":9692.3076923076933},{"$f":"IF(E6=0,\"\",'SUB. 1'!B20)","v":"vaca (4)"},{"$f":"'SUB. 1'!H20","v":2000.0000000000002},{"$f":"IF(G6=0,\"\",'SUB. 1'!B20)","v":""},{"$f":"'SUB. 1'!J20","v":0},{"$f":"'SUB. 1'!L20","v":0},{"$f":"'SUB. 1'!N20","v":7692.3076923076933},{"$f":"'SUB. 1'!R20","v":0}]
[null,{"$f":"IF(C7=0,\"\",'SUB. 1'!B21)","v":""},{"$f":"'SUB. 1'!P21","v":0},{"$f":"IF(E7=0,\"\",'SUB. 1'!B21)","v":""},{"$f":"'SUB. 1'!H21","v":0},{"$f":"IF(G7=0,\"\",'SUB. 1'!B21)","v":""},{"$f":"'SUB. 1'!J21","v":0},{"$f":"'SUB. 1'!L21","v":0},{"$f":"'SUB. 1'!N21","v":0},{"$f":"'SUB. 1'!R21","v":3360}]
[null,{"$f":"IF(C8=0,\"\",'SUB. 1'!B22)","v":""},{"$f":"'SUB. 1'!P22","v":0},{"$f":"IF(E8=0,\"\",'SUB. 1'!B22)","v":""},{"$f":"'SUB. 1'!H22","v":0},{"$f":"IF(G8=0,\"\",'SUB. 1'!B22)","v":""},{"$f":"'SUB. 1'!J22","v":0},{"$f":"'SUB. 1'!L22","v":0},{"$f":"'SUB. 1'!N22","v":0},{"$f":"'SUB. 1'!R22","v":0}]
[null,{"$f":"IF(C9=0,\"\",'SUB. 1'!B23)","v":""},{"$f":"'SUB. 1'!P23","v":0},{"$f":"IF(E9=0,\"\",'SUB. 1'!B23)","v":""},{"$f":"'SUB. 1'!H23","v":0},{"$f":"IF(G9=0,\"\",'SUB. 1'!B23)","v":""},{"$f":"'SUB. 1'!J23","v":0},{"$f":"'SUB. 1'!L23","v":0},{"$f":"'SUB. 1'!N23","v":0},{"$f":"'SUB. 1'!R23","v":0}]
[null,{"$f":"IF(C10=0,\"\",'SUB. 1'!B24)","v":""},{"$f":"'SUB. 1'!P24","v":0},{"$f":"IF(E10=0,\"\",'SUB. 1'!B24)","v":""},{"$f":"'SUB. 1'!H24","v":0},{"$f":"IF(G10=0,\"\",'SUB. 1'!B24)","v":""},{"$f":"'SUB. 1'!J24","v":0},{"$f":"'SUB. 1'!L24","v":0},{"$f":"'SUB. 1'!N24","v":0},{"$f":"'SUB. 1'!R24","v":0}]
[null,{"$f":"IF(C11=0,\"\",'SUB. 1'!B25)","v":""},{"$f":"'SUB. 1'!P25","v":0},{"$f":"IF(E11=0,\"\",'SUB. 1'!B25)","v":""},{"$f":"'SUB. 1'!H25","v":0},{"$f":"IF(G11=0,\"\",'SUB. 1'!B25)","v":""},{"$f":"'SUB. 1'!J25","v":0},{"$f":"'SUB. 1'!L25","v":0},{"$f":"'SUB. 1'!N25","v":0},{"$f":"'SUB. 1'!R25","v":0}]
[null,{"$f":"IF(C12=0,\"\",'SUB. 1'!B26)","v":""},{"$f":"'SUB. 1'!P26","v":0},{"$f":"IF(E12=0,\"\",'SUB. 1'!B26)","v":""},{"$f":"'SUB. 1'!H26","v":0},{"$f":"IF(G12=0,\"\",'SUB. 1'!B26)","v":""},{"$f":"'SUB. 1'!J26","v":0},{"$f":"'SUB. 1'!L26","v":0},{"$f":"'SUB. 1'!N26","v":0},{"$f":"'SUB. 1'!R26","v":0}]
[null,{"$f":"IF(C13=0,\"\",'SUB. 1'!B27)","v":""},{"$f":"'SUB. 1'!P27","v":0},{"$f":"IF(E13=0,\"\",'SUB. 1'!B27)","v":""},{"$f":"'SUB. 1'!H27","v":0},{"$f":"IF(G13=0,\"\",'SUB. 1'!B27)","v":""},{"$f":"'SUB. 1'!J27","v":0},{"$f":"'SUB. 1'!L27","v":0},{"$f":"'SUB. 1'!N27","v":0},{"$f":"'SUB. 1'!R27","v":0}]
[null,{"$f":"IF(C14=0,\"\",'SUB. 1'!B28)","v":""},{"$f":"'SUB. 1'!P28","v":0},{"$f":"IF(E14=0,\"\",'SUB. 1'!B28)","v":""},{"$f":"'SUB. 1'!H28","v":0},{"$f":"IF(G14=0,\"\",'SUB. 1'!B28)","v":""},{"$f":"'SUB. 1'!J28","v":0},{"$f":"'SUB. 1'!L28","v":0},{"$f":"'SUB. 1'!N28","v":0},{"$f":"'SUB. 1'!R28","v":0}]
[null,{"$f":"IF(C15=0,\"\",'SUB. 1'!B29)","v":""},{"$f":"'SUB. 1'!P29","v":0},{"$f":"IF(E15=0,\"\",'SUB. 1'!B29)","v":""},{"$f":"'SUB. 1'!H29","v":0},{"$f":"IF(G15=0,\"\",'SUB. 1'!B29)","v":""},{"$f":"'SUB. 1'!J29","v":0},{"$f":"'SUB. 1'!L29","v":0},{"$f":"'SUB. 1'!N29","v":0},{"$f":"'SUB. 1'!R29","v":0}]
[null,{"$f":"IF(C16=0,\"\",'SUB. 1'!B30)","v":""},{"$f":"'SUB. 1'!P30","v":0},{"$f":"IF(E16=0,\"\",'SUB. 1'!B30)","v":""},{"$f":"'SUB. 1'!H30","v":0},{"$f":"IF(G16=0,\"\",'SUB. 1'!B30)","v":""},{"$f":"'SUB. 1'!J30","v":0},{"$f":"'SUB. 1'!L30","v":0},{"$f":"'SUB. 1'!N30","v":0},{"$f":"'SUB. 1'!R30","v":0}]
[null,{"$f":"IF(C17=0,\"\",'SUB. 1'!B31)","v":""},{"$f":"'SUB. 1'!P31","v":0},{"$f":"IF(E17=0,\"\",'SUB. 1'!B31)","v":""},{"$f":"'SUB. 1'!H31","v":0},{"$f":"IF(G17=0,\"\",'SUB. 1'!B31)","v":""},{"$f":"'SUB. 1'!J31","v":0},{"$f":"'SUB. 1'!L31","v":0},{"$f":"'SUB. 1'!N31","v":0},{"$f":"'SUB. 1'!R31","v":0}]
[null,{"$f":"IF(C18=0,\"\",'SUB. 1'!B32)","v":""},{"$f":"'SUB. 1'!P32","v":0},{"$f":"IF(E18=0,\"\",'SUB. 1'!B32)","v":""},{"$f":"'SUB. 1'!H32","v":0},{"$f":"IF(G18=0,\"\",'SUB. 1'!B32)","v":""},{"$f":"'SUB. 1'!J32","v":0},{"$f":"'SUB. 1'!L32","v":0},{"$f":"'SUB. 1'!N32","v":0},{"$f":"'SUB. 1'!R32","v":0}]
[null,{"$f":"IF(C19=0,\"\",'SUB. 1'!B33)","v":""},{"$f":"'SUB. 1'!P33","v":0},{"$f":"IF(E19=0,\"\",'SUB. 1'!B33)","v":""},{"$f":"'SUB. 1'!H33","v":0},{"$f":"IF(G19=0,\"\",'SUB. 1'!B33)","v":""},{"$f":"'SUB. 1'!J33","v":0},{"$f":"'SUB. 1'!L33","v":0},{"$f":"'SUB. 1'!N33","v":0},{"$f":"'SUB. 1'!R33","v":0}]
[null,{"$f":"IF(C20=0,\"\",'SUB. 1'!B34)","v":""},{"$f":"'SUB. 1'!P34","v":0},{"$f":"IF(E20=0,\"\",'SUB. 1'!B34)","v":""},{"$f":"'SUB. 1'!H34","v":0},{"$f":"IF(G20=0,\"\",'SUB. 1'!B34)","v":""},{"$f":"'SUB. 1'!J34","v":0},{"$f":"'SUB. 1'!L34","v":0},{"$f":"'SUB. 1'!N34","v":0},{"$f":"'SUB. 1'!R34","v":0}]
[null,{"$f":"IF(C21=0,\"\",'SUB. 1'!B35)","v":""},{"$f":"'SUB. 1'!P35","v":0},{"$f":"IF(E21=0,\"\",'SUB. 1'!B35)","v":""},{"$f":"'SUB. 1'!H35","v":0},{"$f":"IF(G21=0,\"\",'SUB. 1'!B35)","v":""},{"$f":"'SUB. 1'!J35","v":0},{"$f":"'SUB. 1'!L35","v":0},{"$f":"'SUB. 1'!N35","v":0},{"$f":"'SUB. 1'!R35","v":0}]
[null,{"$f":"IF(C22=0,\"\",'SUB. 1'!B36)","v":""},{"$f":"'SUB. 1'!P36","v":0},{"$f":"IF(E22=0,\"\",'SUB. 1'!B36)","v":""},{"$f":"'SUB. 1'!H36","v":0},{"$f":"IF(G22=0,\"\",'SUB. 1'!B36)","v":""},{"$f":"'SUB. 1'!J36","v":0},{"$f":"'SUB. 1'!L36","v":0},{"$f":"'SUB. 1'!N36","v":0},{"$f":"'SUB. 1'!R36","v":0}]
["SUBSISTEMA 2",{"$f":"IF(C23=0,\"\",'SUB. 2'!B19)","v":"porco"},{"$f":"'SUB. 2'!P19","v":16830},{"$f":"IF(E23=0,\"\",'SUB. 2'!B19)","v":"porco"},{"$f":"'SUB. 2'!H19","v":7830},{"$f":"IF(G23=0,\"\",'SUB. 2'!B19)","v":"porco"},{"$f":"'SUB. 2'!J19","v":900},{"$f":"'SUB. 2'!L19","v":1500},{"$f":"'SUB. 2'!N19","v":6600},{"$f":"'SUB. 2'!R19","v":0}]
[null,{"$f":"IF(C24=0,\"\",'SUB. 2'!B20)","v":""},{"$f":"'SUB. 2'!P20","v":0},{"$f":"IF(E24=0,\"\",'SUB. 2'!B20)","v":""},{"$f":"'SUB. 2'!H20","v":0},{"$f":"IF(G24=0,\"\",'SUB. 2'!B20)","v":""},{"$f":"'SUB. 2'!J20","v":0},{"$f":"'SUB. 2'!L20","v":0},{"$f":"'SUB. 2'!N20","v":0},{"$f":"'SUB. 2'!R20","v":153.29999999999998}]
[null,{"$f":"IF(C25=0,\"\",'SUB. 2'!B21)","v":""},{"$f":"'SUB. 2'!P21","v":0},{"$f":"IF(E25=0,\"\",'SUB. 2'!B21)","v":""},{"$f":"'SUB. 2'!H21","v":0},{"$f":"IF(G25=0,\"\",'SUB. 2'!B21)","v":""},{"$f":"'SUB. 2'!J21","v":0},{"$f":"'SUB. 2'!L21","v":0},{"$f":"'SUB. 2'!N21","v":0},{"$f":"'SUB. 2'!R21","v":0}]
[null,{"$f":"IF(C26=0,\"\",'SUB. 2'!B22)","v":""},{"$f":"'SUB. 2'!P22","v":0},{"$f":"IF(E26=0,\"\",'SUB. 2'!B22)","v":""},{"$f":"'SUB. 2'!H22","v":0},{"$f":"IF(G26=0,\"\",'SUB. 2'!B22)","v":""},{"$f":"'SUB. 2'!J22","v":0},{"$f":"'SUB. 2'!L22","v":0},{"$f":"'SUB. 2'!N22","v":0},{"$f":"'SUB. 2'!R22","v":0}]
[null,{"$f":"IF(C27=0,\"\",'SUB. 2'!B23)","v":""},{"$f":"'SUB. 2'!P23","v":0},{"$f":"IF(E27=0,\"\",'SUB. 2'!B23)","v":""},{"$f":"'SUB. 2'!H23","v":0},{"$f":"IF(G27=0,\"\",'SUB. 2'!B23)","v":""},{"$f":"'SUB. 2'!J23","v":0},{"$f":"'SUB. 2'!L23","v":0},{"$f":"'SUB. 2'!N23","v":0},{"$f":"'SUB. 2'!R23","v":0}]
[null,{"$f":"IF(C28=0,\"\",'SUB. 2'!B24)","v":""},{"$f":"'SUB. 2'!P24","v":0},{"$f":"IF(E28=0,\"\",'SUB. 2'!B24)","v":""},{"$f":"'SUB. 2'!H24","v":0},{"$f":"IF(G28=0,\"\",'SUB. 2'!B24)","v":""},{"$f":"'SUB. 2'!J24","v":0},{"$f":"'SUB. 2'!L24","v":0},{"$f":"'SUB. 2'!N24","v":0},{"$f":"'SUB. 2'!R24","v":0}]
[null,{"$f":"IF(C29=0,\"\",'SUB. 2'!B25)","v":""},{"$f":"'SUB. 2'!P25","v":0},{"$f":"IF(E29=0,\"\",'SUB. 2'!B25)","v":""},{"$f":"'SUB. 2'!H25","v":0},{"$f":"IF(G29=0,\"\",'SUB. 2'!B25)","v":""},{"$f":"'SUB. 2'!J25","v":0},{"$f":"'SUB. 2'!L25","v":0},{"$f":"'SUB. 2'!N25","v":0},{"$f":"'SUB. 2'!R25","v":0}]
[null,{"$f":"IF(C30=0,\"\",'SUB. 2'!B26)","v":""},{"$f":"'SUB. 2'!P26","v":0},{"$f":"IF(E30=0,\"\",'SUB. 2'!B26)","v":""},{"$f":"'SUB. 2'!H26","v":0},{"$f":"IF(G30=0,\"\",'SUB. 2'!B26)","v":""},{"$f":"'SUB. 2'!J26","v":0},{"$f":"'SUB. 2'!L26","v":0},{"$f":"'SUB. 2'!N26","v":0},{"$f":"'SUB. 2'!R26","v":0}]
[null,{"$f":"IF(C31=0,\"\",'SUB. 2'!B27)","v":""},{"$f":"'SUB. 2'!P27","v":0},{"$f":"IF(E31=0,\"\",'SUB. 2'!B27)","v":""},{"$f":"'SUB. 2'!H27","v":0},{"$f":"IF(G31=0,\"\",'SUB. 2'!B27)","v":""},{"$f":"'SUB. 2'!J27","v":0},{"$f":"'SUB. 2'!L27","v":0},{"$f":"'SUB. 2'!N27","v":0},{"$f":"'SUB. 2'!R27","v":0}]
[null,{"$f":"IF(C32=0,\"\",'SUB. 2'!B28)","v":""},{"$f":"'SUB. 2'!P28","v":0},{"$f":"IF(E32=0,\"\",'SUB. 2'!B28)","v":""},{"$f":"'SUB. 2'!H28","v":0},{"$f":"IF(G32=0,\"\",'SUB. 2'!B28)","v":""},{"$f":"'SUB. 2'!J28","v":0},{"$f":"'SUB. 2'!L28","v":0},{"$f":"'SUB. 2'!N28","v":0},{"$f":"'SUB. 2'!R28","v":0}]
[null,{"$f":"IF(C33=0,\"\",'SUB. 2'!B29)","v":""},{"$f":"'SUB. 2'!P29","v":0},{"$f":"IF(E33=0,\"\",'SUB. 2'!B29)","v":""},{"$f":"'SUB. 2'!H29","v":0},{"$f":"IF(G33=0,\"\",'SUB. 2'!B29)","v":""},{"$f":"'SUB. 2'!J29","v":0},{"$f":"'SUB. 2'!L29","v":0},{"$f":"'SUB. 2'!N29","v":0},{"$f":"'SUB. 2'!R29","v":0}]
[null,{"$f":"IF(C34=0,\"\",'SUB. 2'!B30)","v":""},{"$f":"'SUB. 2'!P30","v":0},{"$f":"IF(E34=0,\"\",'SUB. 2'!B30)","v":""},{"$f":"'SUB. 2'!H30","v":0},{"$f":"IF(G34=0,\"\",'SUB. 2'!B30)","v":""},{"$f":"'SUB. 2'!J30","v":0},{"$f":"'SUB. 2'!L30","v":0},{"$f":"'SUB. 2'!N30","v":0},{"$f":"'SUB. 2'!R30","v":0}]
[null,{"$f":"IF(C35=0,\"\",'SUB. 2'!B31)","v":""},{"$f":"'SUB. 2'!P31","v":0},{"$f":"IF(E35=0,\"\",'SUB. 2'!B31)","v":""},{"$f":"'SUB. 2'!H31","v":0},{"$f":"IF(G35=0,\"\",'SUB. 2'!B31)","v":""},{"$f":"'SUB. 2'!J31","v":0},{"$f":"'SUB. 2'!L31","v":0},{"$f":"'SUB. 2'!N31","v":0},{"$f":"'SUB. 2'!R31","v":0}]
[null,{"$f":"IF(C36=0,\"\",'SUB. 2'!B32)","v":""},{"$f":"'SUB. 2'!P32","v":0},{"$f":"IF(E36=0,\"\",'SUB. 2'!B32)","v":""},{"$f":"'SUB. 2'!H32","v":0},{"$f":"IF(G36=0,\"\",'SUB. 2'!B32)","v":""},{"$f":"'SUB. 2'!J32","v":0},{"$f":"'SUB. 2'!L32","v":0},{"$f":"'SUB. 2'!N32","v":0},{"$f":"'SUB. 2'!R32","v":0}]
[null,{"$f":"IF(C37=0,\"\",'SUB. 2'!B33)","v":""},{"$f":"'SUB. 2'!P33","v":0},{"$f":"IF(E37=0,\"\",'SUB. 2'!B33)","v":""},{"$f":"'SUB. 2'!H33","v":0},{"$f":"IF(G37=0,\"\",'SUB. 2'!B33)","v":""},{"$f":"'SUB. 2'!J33","v":0},{"$f":"'SUB. 2'!L33","v":0},{"$f":"'SUB. 2'!N33","v":0},{"$f":"'SUB. 2'!R33","v":0}]
[null,{"$f":"IF(C38=0,\"\",'SUB. 2'!B34)","v":""},{"$f":"'SUB. 2'!P34","v":0},{"$f":"IF(E38=0,\"\",'SUB. 2'!B34)","v":""},{"$f":"'SUB. 2'!H34","v":0},{"$f":"IF(G38=0,\"\",'SUB. 2'!B34)","v":""},{"$f":"'SUB. 2'!J34","v":0},{"$f":"'SUB. 2'!L34","v":0},{"$f":"'SUB. 2'!N34","v":0},{"$f":"'SUB. 2'!R34","v":0}]
[null,{"$f":"IF(C39=0,\"\",'SUB. 2'!B35)","v":""},{"$f":"'SUB. 2'!P35","v":0},{"$f":"IF(E39=0,\"\",'SUB. 2'!B35)","v":""},{"$f":"'SUB. 2'!H35","v":0},{"$f":"IF(G39=0,\"\",'SUB. 2'!B35)","v":""},{"$f":"'SUB. 2'!J35","v":0},{"$f":"'SUB. 2'!L35","v":0},{"$f":"'SUB. 2'!N35","v":0},{"$f":"'SUB. 2'!R35","v":0}]
[null,{"$f":"IF(C40=0,\"\",'SUB. 2'!B36)","v":""},{"$f":"'SUB. 2'!P36","v":0},{"$f":"IF(E40=0,\"\",'SUB. 2'!B36)","v":""},{"$f":"'SUB. 2'!H36","v":0},{"$f":"IF(G40=0,\"\",'SUB. 2'!B36)","v":""},{"$f":"'SUB. 2'!J36","v":0},{"$f":"'SUB. 2'!L36","v":0},{"$f":"'SUB. 2'!N36","v":0},{"$f":"'SUB. 2'!R36","v":0}]
["SUBSISTEMA 3",{"$f":"IF(C41=0,\"\",'SUB. 3'!B19)","v":"animal"},{"$f":"'SUB. 3'!P19","v":405},{"$f":"IF(E41=0,\"\",'SUB. 3'!B19)","v":"animal"},{"$f":"'SUB. 3'!H19","v":180},{"$f":"IF(G41=0,\"\",'SUB. 3'!B19)","v":""},{"$f":"'SUB. 3'!J19","v":0},{"$f":"'SUB. 3'!L19","v":0},{"$f":"'SUB. 3'!N19","v":225},{"$f":"'SUB. 3'!R19","v":0}]
[null,{"$f":"IF(C42=0,\"\",'SUB. 3'!B20)","v":""},{"$f":"'SUB. 3'!P20","v":0},{"$f":"IF(E42=0,\"\",'SUB. 3'!B20)","v":""},{"$f":"'SUB. 3'!H20","v":0},{"$f":"IF(G42=0,\"\",'SUB. 3'!B20)","v":""},{"$f":"'SUB. 3'!J20","v":0},{"$f":"'SUB. 3'!L20","v":0},{"$f":"'SUB. 3'!N20","v":0},{"$f":"'SUB. 3'!R20","v":630}]
[null,{"$f":"IF(C43=0,\"\",'SUB. 3'!B21)","v":""},{"$f":"'SUB. 3'!P21","v":0},{"$f":"IF(E43=0,\"\",'SUB. 3'!B21)","v":""},{"$f":"'SUB. 3'!H21","v":0},{"$f":"IF(G43=0,\"\",'SUB. 3'!B21)","v":""},{"$f":"'SUB. 3'!J21","v":0},{"$f":"'SUB. 3'!L21","v":0},{"$f":"'SUB. 3'!N21","v":0},{"$f":"'SUB. 3'!R21","v":0}]
[null,{"$f":"IF(C44=0,\"\",'SUB. 3'!B22)","v":""},{"$f":"'SUB. 3'!P22","v":0},{"$f":"IF(E44=0,\"\",'SUB. 3'!B22)","v":""},{"$f":"'SUB. 3'!H22","v":0},{"$f":"IF(G44=0,\"\",'SUB. 3'!B22)","v":""},{"$f":"'SUB. 3'!J22","v":0},{"$f":"'SUB. 3'!L22","v":0},{"$f":"'SUB. 3'!N22","v":0},{"$f":"'SUB. 3'!R22","v":0}]
[null,{"$f":"IF(C45=0,\"\",'SUB. 3'!B23)","v":""},{"$f":"'SUB. 3'!P23","v":0},{"$f":"IF(E45=0,\"\",'SUB. 3'!B23)","v":""},{"$f":"'SUB. 3'!H23","v":0},{"$f":"IF(G45=0,\"\",'SUB. 3'!B23)","v":""},{"$f":"'SUB. 3'!J23","v":0},{"$f":"'SUB. 3'!L23","v":0},{"$f":"'SUB. 3'!N23","v":0},{"$f":"'SUB. 3'!R23","v":0}]
[null,{"$f":"IF(C46=0,\"\",'SUB. 3'!B24)","v":""},{"$f":"'SUB. 3'!P24","v":0},{"$f":"IF(E46=0,\"\",'SUB. 3'!B24)","v":""},{"$f":"'SUB. 3'!H24","v":0},{"$f":"IF(G46=0,\"\",'SUB. 3'!B24)","v":""},{"$f":"'SUB. 3'!J24","v":0},{"$f":"'SUB. 3'!L24","v":0},{"$f":"'SUB. 3'!N24","v":0},{"$f":"'SUB. 3'!R24","v":0}]
[null,{"$f":"IF(C47=0,\"\",'SUB. 3'!B25)","v":""},{"$f":"'SUB. 3'!P25","v":0},{"$f":"IF(E47=0,\"\",'SUB. 3'!B25)","v":""},{"$f":"'SUB. 3'!H25","v":0},{"$f":"IF(G47=0,\"\",'SUB. 3'!B25)","v":""},{"$f":"'SUB. 3'!J25","v":0},{"$f":"'SUB. 3'!L25","v":0},{"$f":"'SUB. 3'!N25","v":0},{"$f":"'SUB. 3'!R25","v":0}]
[null,{"$f":"IF(C48=0,\"\",'SUB. 3'!B26)","v":""},{"$f":"'SUB. 3'!P26","v":0},{"$f":"IF(E48=0,\"\",'SUB. 3'!B26)","v":""},{"$f":"'SUB. 3'!H26","v":0},{"$f":"IF(G48=0,\"\",'SUB. 3'!B26)","v":""},{"$f":"'SUB. 3'!J26","v":0},{"$f":"'SUB. 3'!L26","v":0},{"$f":"'SUB. 3'!N26","v":0},{"$f":"'SUB. 3'!R26","v":0}]
[null,{"$f":"IF(C49=0,\"\",'SUB. 3'!B27)","v":""},{"$f":"'SUB. 3'!P27","v":0},{"$f":"IF(E49=0,\"\",'SUB. 3'!B27)","v":""},{"$f":"'SUB. 3'!H27","v":0},{"$f":"IF(G49=0,\"\",'SUB. 3'!B27)","v":""},{"$f":"'SUB. 3'!J27","v":0},{"$f":"'SUB. 3'!L27","v":0},{"$f":"'SUB. 3'!N27","v":0},{"$f":"'SUB. 3'!R27","v":0}]
[null,{"$f":"IF(C50=0,\"\",'SUB. 3'!B28)","v":""},{"$f":"'SUB. 3'!P28","v":0},{"$f":"IF(E50=0,\"\",'SUB. 3'!B28)","v":""},{"$f":"'SUB. 3'!H28","v":0},{"$f":"IF(G50=0,\"\",'SUB. 3'!B28)","v":""},{"$f":"'SUB. 3'!J28","v":0},{"$f":"'SUB. 3'!L28","v":0},{"$f":"'SUB. 3'!N28","v":0},{"$f":"'SUB. 3'!R28","v":0}]
[null,{"$f":"IF(C51=0,\"\",'SUB. 3'!B29)","v":""},{"$f":"'SUB. 3'!P29","v":0},{"$f":"IF(E51=0,\"\",'SUB. 3'!B29)","v":""},{"$f":"'SUB. 3'!H29","v":0},{"$f":"IF(G51=0,\"\",'SUB. 3'!B29)","v":""},{"$f":"'SUB. 3'!J29","v":0},{"$f":"'SUB. 3'!L29","v":0},{"$f":"'SUB. 3'!N29","v":0},{"$f":"'SUB. 3'!R29","v":0}]
[null,{"$f":"IF(C52=0,\"\",'SUB. 3'!B30)","v":""},{"$f":"'SUB. 3'!P30","v":0},{"$f":"IF(E52=0,\"\",'SUB. 3'!B30)","v":""},{"$f":"'SUB. 3'!H30","v":0},{"$f":"IF(G52=0,\"\",'SUB. 3'!B30)","v":""},{"$f":"'SUB. 3'!J30","v":0},{"$f":"'SUB. 3'!L30","v":0},{"$f":"'SUB. 3'!N30","v":0},{"$f":"'SUB. 3'!R30","v":0}]
[null,{"$f":"IF(C53=0,\"\",'SUB. 3'!B31)","v":""},{"$f":"'SUB. 3'!P31","v":0},{"$f":"IF(E53=0,\"\",'SUB. 3'!B31)","v":""},{"$f":"'SUB. 3'!H31","v":0},{"$f":"IF(G53=0,\"\",'SUB. 3'!B31)","v":""},{"$f":"'SUB. 3'!J31","v":0},{"$f":"'SUB. 3'!L31","v":0},{"$f":"'SUB. 3'!N31","v":0},{"$f":"'SUB. 3'!R31","v":0}]
[null,{"$f":"IF(C54=0,\"\",'SUB. 3'!B32)","v":""},{"$f":"'SUB. 3'!P32","v":0},{"$f":"IF(E54=0,\"\",'SUB. 3'!B32)","v":""},{"$f":"'SUB. 3'!H32","v":0},{"$f":"IF(G54=0,\"\",'SUB. 3'!B32)","v":""},{"$f":"'SUB. 3'!J32","v":0},{"$f":"'SUB. 3'!L32","v":0},{"$f":"'SUB. 3'!N32","v":0},{"$f":"'SUB. 3'!R32","v":0}]
[null,{"$f":"IF(C55=0,\"\",'SUB. 3'!B33)","v":""},{"$f":"'SUB. 3'!P33","v":0},{"$f":"IF(E55=0,\"\",'SUB. 3'!B33)","v":""},{"$f":"'SUB. 3'!H33","v":0},{"$f":"IF(G55=0,\"\",'SUB. 3'!B33)","v":""},{"$f":"'SUB. 3'!J33","v":0},{"$f":"'SUB. 3'!L33","v":0},{"$f":"'SUB. 3'!N33","v":0},{"$f":"'SUB. 3'!R33","v":0}]
[null,{"$f":"IF(C56=0,\"\",'SUB. 3'!B34)","v":""},{"$f":"'SUB. 3'!P34","v":0},{"$f":"IF(E56=0,\"\",'SUB. 3'!B34)","v":""},{"$f":"'SUB. 3'!H34","v":0},{"$f":"IF(G56=0,\"\",'SUB. 3'!B34)","v":""},{"$f":"'SUB. 3'!J34","v":0},{"$f":"'SUB. 3'!L34","v":0},{"$f":"'SUB. 3'!N34","v":0},{"$f":"'SUB. 3'!R34","v":0}]
[null,{"$f":"IF(C57=0,\"\",'SUB. 3'!B35)","v":""},{"$f":"'SUB. 3'!P35","v":0},{"$f":"IF(E57=0,\"\",'SUB. 3'!B35)","v":""},{"$f":"'SUB. 3'!H35","v":0},{"$f":"IF(G57=0,\"\",'SUB. 3'!B35)","v":""},{"$f":"'SUB. 3'!J35","v":0},{"$f":"'SUB. 3'!L35","v":0},{"$f":"'SUB. 3'!N35","v":0},{"$f":"'SUB. 3'!R35","v":0}]
[null,{"$f":"IF(C58=0,\"\",'SUB. 3'!B36)","v":""},{"$f":"'SUB. 3'!P36","v":0},{"$f":"IF(E58=0,\"\",'SUB. 3'!B36)","v":""},{"$f":"'SUB. 3'!H36","v":0},{"$f":"IF(G58=0,\"\",'SUB. 3'!B36)","v":""},{"$f":"'SUB. 3'!J36","v":0},{"$f":"'SUB. 1'!K48","v":0},{"$f":"'SUB. 3'!N36","v":0},{"$f":"'SUB. 3'!R36","v":0}]
["SUBSISTEMA 4",{"$f":"IF(C59=0,\"\",'SUB. 4'!B19)","v":"Galinhas "},{"$f":"'SUB. 4'!P19","v":2580},{"$f":"IF(E59=0,\"\",'SUB. 4'!B19)","v":"Galinhas "},{"$f":"'SUB. 4'!H19","v":180},{"$f":"IF(G59=0,\"\",'SUB. 4'!B19)","v":"Galinhas "},{"$f":"'SUB. 4'!J19","v":1440},{"$f":"'SUB. 4'!L19","v":360},{"$f":"'SUB. 4'!N19","v":600},{"$f":"'SUB. 4'!R19","v":0}]
[null,{"$f":"IF(C60=0,\"\",'SUB. 4'!B20)","v":"Pato"},{"$f":"'SUB. 4'!P20","v":400},{"$f":"IF(E60=0,\"\",'SUB. 4'!B20)","v":""},{"$f":"'SUB. 4'!H20","v":0},{"$f":"IF(G60=0,\"\",'SUB. 4'!B20)","v":"Pato"},{"$f":"'SUB. 4'!J20","v":300},{"$f":"'SUB. 4'!L20","v":0},{"$f":"'SUB. 4'!N20","v":100},{"$f":"'SUB. 4'!R20","v":0}]
[null,{"$f":"IF(C61=0,\"\",'SUB. 4'!B21)","v":"Peru"},{"$f":"'SUB. 4'!P21","v":60},{"$f":"IF(E61=0,\"\",'SUB. 4'!B21)","v":""},{"$f":"'SUB. 4'!H21","v":0},{"$f":"IF(G61=0,\"\",'SUB. 4'!B21)","v":""},{"$f":"'SUB. 4'!J21","v":0},{"$f":"'SUB. 4'!L21","v":0},{"$f":"'SUB. 4'!N21","v":60},{"$f":"'SUB. 4'!R21","v":0}]
[null,{"$f":"IF(C62=0,\"\",'SUB. 4'!B22)","v":"ovo"},{"$f":"'SUB. 4'!P22","v":292.91666666666669},{"$f":"IF(E62=0,\"\",'SUB. 4'!B22)","v":"ovo"},{"$f":"'SUB. 4'!H22","v":30},{"$f":"IF(G62=0,\"\",'SUB. 4'!B22)","v":"ovo"},{"$f":"'SUB. 4'!J22","v":240},{"$f":"'SUB. 4'!L22","v":16.666666666666668},{"$f":"'SUB. 4'!N22","v":6.25},{"$f":"'SUB. 4'!R22","v":0}]
[null,{"$f":"IF(C63=0,\"\",'SUB. 4'!B23)","v":""},{"$f":"'SUB. 4'!P23","v":0},{"$f":"IF(E63=0,\"\",'SUB. 4'!B23)","v":""},{"$f":"'SUB. 4'!H23","v":0},{"$f":"IF(G63=0,\"\",'SUB. 4'!B23)","v":""},{"$f":"'SUB. 4'!J23","v":0},{"$f":"'SUB. 4'!L23","v":0},{"$f":"'SUB. 4'!N23","v":0},{"$f":"'SUB. 4'!R23","v":72}]
[null,{"$f":"IF(C64=0,\"\",'SUB. 4'!B24)","v":""},{"$f":"'SUB. 4'!P24","v":0},{"$f":"IF(E64=0,\"\",'SUB. 4'!B24)","v":""},{"$f":"'SUB. 4'!H24","v":0},{"$f":"IF(G64=0,\"\",'SUB. 4'!B24)","v":""},{"$f":"'SUB. 4'!J24","v":0},{"$f":"'SUB. 4'!L24","v":0},{"$f":"'SUB. 4'!N24","v":0},{"$f":"'SUB. 4'!R24","v":0}]
[null,{"$f":"IF(C65=0,\"\",'SUB. 4'!B25)","v":""},{"$f":"'SUB. 4'!P25","v":0},{"$f":"IF(E65=0,\"\",'SUB. 4'!B25)","v":""},{"$f":"'SUB. 4'!H25","v":0},{"$f":"IF(G65=0,\"\",'SUB. 4'!B25)","v":""},{"$f":"'SUB. 4'!J25","v":0},{"$f":"'SUB. 4'!L25","v":0},{"$f":"'SUB. 4'!N25","v":0},{"$f":"'SUB. 4'!R25","v":0}]
[null,{"$f":"IF(C66=0,\"\",'SUB. 4'!B26)","v":""},{"$f":"'SUB. 4'!P26","v":0},{"$f":"IF(E66=0,\"\",'SUB. 4'!B26)","v":""},{"$f":"'SUB. 4'!H26","v":0},{"$f":"IF(G66=0,\"\",'SUB. 4'!B26)","v":""},{"$f":"'SUB. 4'!J26","v":0},{"$f":"'SUB. 4'!L26","v":0},{"$f":"'SUB. 4'!N26","v":0},{"$f":"'SUB. 4'!R26","v":0}]
[null,{"$f":"IF(C67=0,\"\",'SUB. 4'!B27)","v":""},{"$f":"'SUB. 4'!P27","v":0},{"$f":"IF(E67=0,\"\",'SUB. 4'!B27)","v":""},{"$f":"'SUB. 4'!H27","v":0},{"$f":"IF(G67=0,\"\",'SUB. 4'!B27)","v":""},{"$f":"'SUB. 4'!J27","v":0},{"$f":"'SUB. 4'!L27","v":0},{"$f":"'SUB. 4'!N27","v":0},{"$f":"'SUB. 4'!R27","v":0}]
[null,{"$f":"IF(C68=0,\"\",'SUB. 4'!B28)","v":""},{"$f":"'SUB. 4'!P28","v":0},{"$f":"IF(E68=0,\"\",'SUB. 4'!B28)","v":""},{"$f":"'SUB. 4'!H28","v":0},{"$f":"IF(G68=0,\"\",'SUB. 4'!B28)","v":""},{"$f":"'SUB. 4'!J28","v":0},{"$f":"'SUB. 4'!L28","v":0},{"$f":"'SUB. 4'!N28","v":0},{"$f":"'SUB. 4'!R28","v":0}]
[null,{"$f":"IF(C69=0,\"\",'SUB. 4'!B29)","v":""},{"$f":"'SUB. 4'!P29","v":0},{"$f":"IF(E69=0,\"\",'SUB. 4'!B29)","v":""},{"$f":"'SUB. 4'!H29","v":0},{"$f":"IF(G69=0,\"\",'SUB. 4'!B29)","v":""},{"$f":"'SUB. 4'!J29","v":0},{"$f":"'SUB. 4'!L29","v":0},{"$f":"'SUB. 4'!N29","v":0},{"$f":"'SUB. 4'!R29","v":0}]
[null,{"$f":"IF(C70=0,\"\",'SUB. 4'!B30)","v":""},{"$f":"'SUB. 4'!P30","v":0},{"$f":"IF(E70=0,\"\",'SUB. 4'!B30)","v":""},{"$f":"'SUB. 4'!H30","v":0},{"$f":"IF(G70=0,\"\",'SUB. 4'!B30)","v":""},{"$f":"'SUB. 4'!J30","v":0},{"$f":"'SUB. 4'!L30","v":0},{"$f":"'SUB. 4'!N30","v":0},{"$f":"'SUB. 4'!R30","v":0}]
[null,{"$f":"IF(C71=0,\"\",'SUB. 4'!B31)","v":""},{"$f":"'SUB. 4'!P31","v":0},{"$f":"IF(E71=0,\"\",'SUB. 4'!B31)","v":""},{"$f":"'SUB. 4'!H31","v":0},{"$f":"IF(G71=0,\"\",'SUB. 4'!B31)","v":""},{"$f":"'SUB. 4'!J31","v":0},{"$f":"'SUB. 4'!L31","v":0},{"$f":"'SUB. 4'!N31","v":0},{"$f":"'SUB. 4'!R31","v":0}]
[null,{"$f":"IF(C72=0,\"\",'SUB. 4'!B32)","v":""},{"$f":"'SUB. 4'!P32","v":0},{"$f":"IF(E72=0,\"\",'SUB. 4'!B32)","v":""},{"$f":"'SUB. 4'!H32","v":0},{"$f":"IF(G72=0,\"\",'SUB. 4'!B32)","v":""},{"$f":"'SUB. 4'!J32","v":0},{"$f":"'SUB. 4'!L32","v":0},{"$f":"'SUB. 4'!N32","v":0},{"$f":"'SUB. 4'!R32","v":0}]
[null,{"$f":"IF(C73=0,\"\",'SUB. 4'!B33)","v":""},{"$f":"'SUB. 4'!P33","v":0},{"$f":"IF(E73=0,\"\",'SUB. 4'!B33)","v":""},{"$f":"'SUB. 4'!H33","v":0},{"$f":"IF(G73=0,\"\",'SUB. 4'!B33)","v":""},{"$f":"'SUB. 4'!J33","v":0},{"$f":"'SUB. 4'!L33","v":0},{"$f":"'SUB. 4'!N33","v":0},{"$f":"'SUB. 4'!R33","v":0}]
[null,{"$f":"IF(C74=0,\"\",'SUB. 4'!B34)","v":""},{"$f":"'SUB. 4'!P34","v":0},{"$f":"IF(E74=0,\"\",'SUB. 4'!B34)","v":""},{"$f":"'SUB. 4'!H34","v":0},{"$f":"IF(G74=0,\"\",'SUB. 4'!B34)","v":""},{"$f":"'SUB. 4'!J34","v":0},{"$f":"'SUB. 4'!L34","v":0},{"$f":"'SUB. 4'!N34","v":0},{"$f":"'SUB. 4'!R34","v":0}]
[null,{"$f":"IF(C75=0,\"\",'SUB. 4'!B35)","v":""},{"$f":"'SUB. 4'!P35","v":0},{"$f":"IF(E75=0,\"\",'SUB. 4'!B35)","v":""},{"$f":"'SUB. 4'!H35","v":0},{"$f":"IF(G75=0,\"\",'SUB. 4'!B35)","v":""},{"$f":"'SUB. 4'!J35","v":0},{"$f":"'SUB. 4'!L35","v":0},{"$f":"'SUB. 4'!N35","v":0},{"$f":"'SUB. 4'!R35","v":0}]
[null,{"$f":"IF(C76=0,\"\",'SUB. 4'!B36)","v":""},{"$f":"'SUB. 4'!P36","v":0},{"$f":"IF(E76=0,\"\",'SUB. 4'!B36)","v":""},{"$f":"'SUB. 4'!H36","v":0},{"$f":"IF(G76=0,\"\",'SUB. 4'!B36)","v":""},{"$f":"'SUB. 4'!J36","v":0},{"$f":"'SUB. 4'!L36","v":0},{"$f":"'SUB. 4'!N36","v":0},{"$f":"'SUB. 4'!R36","v":0}]
["SUBSISTEMA 5",{"$f":"IF(C77=0,\"\",'SUB. 5'!B19)","v":""},{"$f":"'SUB. 5'!P19","v":0},{"$f":"IF(E77=0,\"\",'SUB. 5'!B19)","v":""},{"$f":"'SUB. 5'!H19","v":0},{"$f":"IF(G77=0,\"\",'SUB. 5'!B19)","v":""},{"$f":"'SUB. 5'!J19","v":0},{"$f":"'SUB. 5'!L19","v":0},{"$f":"'SUB. 5'!N19","v":0},{"$f":"'SUB. 5'!R19","v":4020}]
[null,{"$f":"IF(C78=0,\"\",'SUB. 5'!B20)","v":"Millho seco"},{"$f":"'SUB. 5'!P20","v":270},{"$f":"IF(E78=0,\"\",'SUB. 5'!B20)","v":"Millho seco"},{"$f":"'SUB. 5'!H20","v":200},{"$f":"IF(G78=0,\"\",'SUB. 5'!B20)","v":"Millho seco"},{"$f":"'SUB. 5'!J20","v":50},{"$f":"'SUB. 5'!L20","v":20},{"$f":"'SUB. 5'!N20","v":0},{"$f":"'SUB. 5'!R20","v":0}]
[null,{"$f":"IF(C79=0,\"\",'SUB. 5'!B21)","v":""},{"$f":"'SUB. 5'!P21","v":0},{"$f":"IF(E79=0,\"\",'SUB. 5'!B21)","v":""},{"$f":"'SUB. 5'!H21","v":0},{"$f":"IF(G79=0,\"\",'SUB. 5'!B21)","v":""},{"$f":"'SUB. 5'!J21","v":0},{"$f":"'SUB. 5'!L21","v":0},{"$f":"'SUB. 5'!N21","v":0},{"$f":"'SUB. 5'!R21","v":0}]
[null,{"$f":"IF(C80=0,\"\",'SUB. 5'!B22)","v":""},{"$f":"'SUB. 5'!P22","v":0},{"$f":"IF(E80=0,\"\",'SUB. 5'!B22)","v":""},{"$f":"'SUB. 5'!H22","v":0},{"$f":"IF(G80=0,\"\",'SUB. 5'!B22)","v":""},{"$f":"'SUB. 5'!J22","v":0},{"$f":"'SUB. 5'!L22","v":0},{"$f":"'SUB. 5'!N22","v":0},{"$f":"'SUB. 5'!R22","v":0}]
[null,{"$f":"IF(C81=0,\"\",'SUB. 5'!B23)","v":""},{"$f":"'SUB. 5'!P23","v":0},{"$f":"IF(E81=0,\"\",'SUB. 5'!B23)","v":""},{"$f":"'SUB. 5'!H23","v":0},{"$f":"IF(G81=0,\"\",'SUB. 5'!B23)","v":""},{"$f":"'SUB. 5'!J23","v":0},{"$f":"'SUB. 5'!L23","v":0},{"$f":"'SUB. 5'!N23","v":0},{"$f":"'SUB. 5'!R23","v":0}]
[null,{"$f":"IF(C82=0,\"\",'SUB. 5'!B24)","v":""},{"$f":"'SUB. 5'!P24","v":0},{"$f":"IF(E82=0,\"\",'SUB. 5'!B24)","v":""},{"$f":"'SUB. 5'!H24","v":0},{"$f":"IF(G82=0,\"\",'SUB. 5'!B24)","v":""},{"$f":"'SUB. 5'!J24","v":0},{"$f":"'SUB. 5'!L24","v":0},{"$f":"'SUB. 5'!N24","v":0},{"$f":"'SUB. 5'!R24","v":0}]
[null,{"$f":"IF(C83=0,\"\",'SUB. 5'!B25)","v":""},{"$f":"'SUB. 5'!P25","v":0},{"$f":"IF(E83=0,\"\",'SUB. 5'!B25)","v":""},{"$f":"'SUB. 5'!H25","v":0},{"$f":"IF(G83=0,\"\",'SUB. 5'!B25)","v":""},{"$f":"'SUB. 5'!J25","v":0},{"$f":"'SUB. 5'!L25","v":0},{"$f":"'SUB. 5'!N25","v":0},{"$f":"'SUB. 5'!R25","v":0}]
[null,{"$f":"IF(C84=0,\"\",'SUB. 5'!B26)","v":""},{"$f":"'SUB. 5'!P26","v":0},{"$f":"IF(E84=0,\"\",'SUB. 5'!B26)","v":""},{"$f":"'SUB. 5'!H26","v":0},{"$f":"IF(G84=0,\"\",'SUB. 5'!B26)","v":""},{"$f":"'SUB. 5'!J26","v":0},{"$f":"'SUB. 5'!L26","v":0},{"$f":"'SUB. 5'!N26","v":0},{"$f":"'SUB. 5'!R26","v":0}]
[null,{"$f":"IF(C85=0,\"\",'SUB. 5'!B27)","v":""},{"$f":"'SUB. 5'!P27","v":0},{"$f":"IF(E85=0,\"\",'SUB. 5'!B27)","v":""},{"$f":"'SUB. 5'!H27","v":0},{"$f":"IF(G85=0,\"\",'SUB. 5'!B27)","v":""},{"$f":"'SUB. 5'!J27","v":0},{"$f":"'SUB. 5'!L27","v":0},{"$f":"'SUB. 5'!N27","v":0},{"$f":"'SUB. 5'!R27","v":0}]
[null,{"$f":"IF(C86=0,\"\",'SUB. 5'!B28)","v":""},{"$f":"'SUB. 5'!P28","v":0},{"$f":"IF(E86=0,\"\",'SUB. 5'!B28)","v":""},{"$f":"'SUB. 5'!H28","v":0},{"$f":"IF(G86=0,\"\",'SUB. 5'!B28)","v":""},{"$f":"'SUB. 5'!J28","v":0},{"$f":"'SUB. 5'!L28","v":0},{"$f":"'SUB. 5'!N28","v":0},{"$f":"'SUB. 5'!R28","v":0}]
[null,{"$f":"IF(C87=0,\"\",'SUB. 5'!B29)","v":""},{"$f":"'SUB. 5'!P29","v":0},{"$f":"IF(E87=0,\"\",'SUB. 5'!B29)","v":""},{"$f":"'SUB. 5'!H29","v":0},{"$f":"IF(G87=0,\"\",'SUB. 5'!B29)","v":""},{"$f":"'SUB. 5'!J29","v":0},{"$f":"'SUB. 5'!L29","v":0},{"$f":"'SUB. 5'!N29","v":0},{"$f":"'SUB. 5'!R29","v":0}]
[null,{"$f":"IF(C88=0,\"\",'SUB. 5'!B30)","v":""},{"$f":"'SUB. 5'!P30","v":0},{"$f":"IF(E88=0,\"\",'SUB. 5'!B30)","v":""},{"$f":"'SUB. 5'!H30","v":0},{"$f":"IF(G88=0,\"\",'SUB. 5'!B30)","v":""},{"$f":"'SUB. 5'!J30","v":0},{"$f":"'SUB. 5'!L30","v":0},{"$f":"'SUB. 5'!N30","v":0},{"$f":"'SUB. 5'!R30","v":0}]
[null,{"$f":"IF(C89=0,\"\",'SUB. 5'!B31)","v":""},{"$f":"'SUB. 5'!P31","v":0},{"$f":"IF(E89=0,\"\",'SUB. 5'!B31)","v":""},{"$f":"'SUB. 5'!H31","v":0},{"$f":"IF(G89=0,\"\",'SUB. 5'!B31)","v":""},{"$f":"'SUB. 5'!J31","v":0},{"$f":"'SUB. 5'!L31","v":0},{"$f":"'SUB. 5'!N31","v":0},{"$f":"'SUB. 5'!R31","v":0}]
[null,{"$f":"IF(C90=0,\"\",'SUB. 5'!B32)","v":""},{"$f":"'SUB. 5'!P32","v":0},{"$f":"IF(E90=0,\"\",'SUB. 5'!B32)","v":""},{"$f":"'SUB. 5'!H32","v":0},{"$f":"IF(G90=0,\"\",'SUB. 5'!B32)","v":""},{"$f":"'SUB. 5'!J32","v":0},{"$f":"'SUB. 5'!L32","v":0},{"$f":"'SUB. 5'!N32","v":0},{"$f":"'SUB. 5'!R32","v":0}]
[null,{"$f":"IF(C91=0,\"\",'SUB. 5'!B33)","v":""},{"$f":"'SUB. 5'!P33","v":0},{"$f":"IF(E91=0,\"\",'SUB. 5'!B33)","v":""},{"$f":"'SUB. 5'!H33","v":0},{"$f":"IF(G91=0,\"\",'SUB. 5'!B33)","v":""},{"$f":"'SUB. 5'!J33","v":0},{"$f":"'SUB. 5'!L33","v":0},{"$f":"'SUB. 5'!N33","v":0},{"$f":"'SUB. 5'!R33","v":0}]
[null,{"$f":"IF(C92=0,\"\",'SUB. 5'!B34)","v":""},{"$f":"'SUB. 5'!P34","v":0},{"$f":"IF(E92=0,\"\",'SUB. 5'!B34)","v":""},{"$f":"'SUB. 5'!H34","v":0},{"$f":"IF(G92=0,\"\",'SUB. 5'!B34)","v":""},{"$f":"'SUB. 5'!J34","v":0},{"$f":"'SUB. 5'!L34","v":0},{"$f":"'SUB. 5'!N34","v":0},{"$f":"'SUB. 5'!R34","v":0}]
[null,{"$f":"IF(C93=0,\"\",'SUB. 5'!B35)","v":""},{"$f":"'SUB. 5'!P35","v":0},{"$f":"IF(E93=0,\"\",'SUB. 5'!B35)","v":""},{"$f":"'SUB. 5'!H35","v":0},{"$f":"IF(G93=0,\"\",'SUB. 5'!B35)","v":""},{"$f":"'SUB. 5'!J35","v":0},{"$f":"'SUB. 5'!L35","v":0},{"$f":"'SUB. 5'!N35","v":0},{"$f":"'SUB. 5'!R35","v":0}]
[null,{"$f":"IF(C94=0,\"\",'SUB. 5'!B36)","v":""},{"$f":"'SUB. 5'!P36","v":0},{"$f":"IF(E94=0,\"\",'SUB. 5'!B36)","v":""},{"$f":"'SUB. 5'!H36","v":0},{"$f":"IF(G94=0,\"\",'SUB. 5'!B36)","v":""},{"$f":"'SUB. 5'!J36","v":0},{"$f":"'SUB. 5'!L36","v":0},{"$f":"'SUB. 5'!N36","v":0},{"$f":"'SUB. 5'!R36","v":0}]
["SUBSISTEMA 6",{"$f":"IF(C95=0,\"\",'SUB. 6'!B19)","v":""},{"$f":"'SUB. 6'!P19","v":0},{"$f":"IF(E95=0,\"\",'SUB. 6'!B19)","v":""},{"$f":"'SUB. 6'!H19","v":0},{"$f":"IF(G95=0,\"\",'SUB. 6'!B19)","v":""},{"$f":"'SUB. 6'!J19","v":0},{"$f":"'SUB. 6'!L19","v":0},{"$f":"'SUB. 6'!N19","v":0},{"$f":"'SUB. 6'!R19","v":549}]
[null,{"$f":"IF(C96=0,\"\",'SUB. 6'!B20)","v":"jenipapo"},{"$f":"'SUB. 6'!P20","v":45},{"$f":"IF(E96=0,\"\",'SUB. 6'!B20)","v":""},{"$f":"'SUB. 6'!H20","v":0},{"$f":"IF(G96=0,\"\",'SUB. 6'!B20)","v":"jenipapo"},{"$f":"'SUB. 6'!J20","v":45},{"$f":"'SUB. 6'!L20","v":0},{"$f":"'SUB. 6'!N20","v":0},{"$f":"'SUB. 6'!R20","v":0}]
[null,{"$f":"IF(C97=0,\"\",'SUB. 6'!B21)","v":"cidreira"},{"$f":"'SUB. 6'!P21","v":96},{"$f":"IF(E97=0,\"\",'SUB. 6'!B21)","v":""},{"$f":"'SUB. 6'!H21","v":0},{"$f":"IF(G97=0,\"\",'SUB. 6'!B21)","v":"cidreira"},{"$f":"'SUB. 6'!J21","v":96},{"$f":"'SUB. 6'!L21","v":0},{"$f":"'SUB. 6'!N21","v":0},{"$f":"'SUB. 6'!R21","v":0}]
[null,{"$f":"IF(C98=0,\"\",'SUB. 6'!B22)","v":"açerola"},{"$f":"'SUB. 6'!P22","v":96},{"$f":"IF(E98=0,\"\",'SUB. 6'!B22)","v":""},{"$f":"'SUB. 6'!H22","v":0},{"$f":"IF(G98=0,\"\",'SUB. 6'!B22)","v":"açerola"},{"$f":"'SUB. 6'!J22","v":96},{"$f":"'SUB. 6'!L22","v":0},{"$f":"'SUB. 6'!N22","v":0},{"$f":"'SUB. 6'!R22","v":0}]
[null,{"$f":"IF(C99=0,\"\",'SUB. 6'!B23)","v":"pinha"},{"$f":"'SUB. 6'!P23","v":60},{"$f":"IF(E99=0,\"\",'SUB. 6'!B23)","v":""},{"$f":"'SUB. 6'!H23","v":0},{"$f":"IF(G99=0,\"\",'SUB. 6'!B23)","v":"pinha"},{"$f":"'SUB. 6'!J23","v":60},{"$f":"'SUB. 6'!L23","v":0},{"$f":"'SUB. 6'!N23","v":0},{"$f":"'SUB. 6'!R23","v":0}]
[null,{"$f":"IF(C100=0,\"\",'SUB. 6'!B24)","v":"coco verde"},{"$f":"'SUB. 6'!P24","v":140},{"$f":"IF(E100=0,\"\",'SUB. 6'!B24)","v":""},{"$f":"'SUB. 6'!H24","v":0},{"$f":"IF(G100=0,\"\",'SUB. 6'!B24)","v":"coco verde"},{"$f":"'SUB. 6'!J24","v":140},{"$f":"'SUB. 6'!L24","v":0},{"$f":"'SUB. 6'!N24","v":0},{"$f":"'SUB. 6'!R24","v":0}]
[null,{"$f":"IF(C101=0,\"\",'SUB. 6'!B25)","v":"laranja"},{"$f":"'SUB. 6'!P25","v":12},{"$f":"IF(E101=0,\"\",'SUB. 6'!B25)","v":""},{"$f":"'SUB. 6'!H25","v":0},{"$f":"IF(G101=0,\"\",'SUB. 6'!B25)","v":"laranja"},{"$f":"'SUB. 6'!J25","v":12},{"$f":"'SUB. 6'!L25","v":0},{"$f":"'SUB. 6'!N25","v":0},{"$f":"'SUB. 6'!R25","v":0}]
[null,{"$f":"IF(C102=0,\"\",'SUB. 6'!B26)","v":"hortelã de sete dor"},{"$f":"'SUB. 6'!P26","v":96},{"$f":"IF(E102=0,\"\",'SUB. 6'!B26)","v":""},{"$f":"'SUB. 6'!H26","v":0},{"$f":"IF(G102=0,\"\",'SUB. 6'!B26)","v":"hortelã de sete dor"},{"$f":"'SUB. 6'!J26","v":96},{"$f":"'SUB. 6'!L26","v":0},{"$f":"'SUB. 6'!N26","v":0},{"$f":"'SUB. 6'!R26","v":0}]
[null,{"$f":"IF(C103=0,\"\",'SUB. 6'!B27)","v":"hortelã"},{"$f":"'SUB. 6'!P27","v":96},{"$f":"IF(E103=0,\"\",'SUB. 6'!B27)","v":""},{"$f":"'SUB. 6'!H27","v":0},{"$f":"IF(G103=0,\"\",'SUB. 6'!B27)","v":"hortelã"},{"$f":"'SUB. 6'!J27","v":96},{"$f":"'SUB. 6'!L27","v":0},{"$f":"'SUB. 6'!N27","v":0},{"$f":"'SUB. 6'!R27","v":0}]
[null,{"$f":"IF(C104=0,\"\",'SUB. 6'!B28)","v":"samba caitá"},{"$f":"'SUB. 6'!P28","v":96},{"$f":"IF(E104=0,\"\",'SUB. 6'!B28)","v":""},{"$f":"'SUB. 6'!H28","v":0},{"$f":"IF(G104=0,\"\",'SUB. 6'!B28)","v":"samba caitá"},{"$f":"'SUB. 6'!J28","v":96},{"$f":"'SUB. 6'!L28","v":0},{"$f":"'SUB. 6'!N28","v":0},{"$f":"'SUB. 6'!R28","v":0}]
[null,{"$f":"IF(C105=0,\"\",'SUB. 6'!B29)","v":"couve"},{"$f":"'SUB. 6'!P29","v":336},{"$f":"IF(E105=0,\"\",'SUB. 6'!B29)","v":""},{"$f":"'SUB. 6'!H29","v":0},{"$f":"IF(G105=0,\"\",'SUB. 6'!B29)","v":"couve"},{"$f":"'SUB. 6'!J29","v":192},{"$f":"'SUB. 6'!L29","v":144},{"$f":"'SUB. 6'!N29","v":0},{"$f":"'SUB. 6'!R29","v":0}]
[null,{"$f":"IF(C106=0,\"\",'SUB. 6'!B30)","v":"pimentão "},{"$f":"'SUB. 6'!P30","v":4},{"$f":"IF(E106=0,\"\",'SUB. 6'!B30)","v":""},{"$f":"'SUB. 6'!H30","v":0},{"$f":"IF(G106=0,\"\",'SUB. 6'!B30)","v":"pimentão "},{"$f":"'SUB. 6'!J30","v":4},{"$f":"'SUB. 6'!L30","v":0},{"$f":"'SUB. 6'!N30","v":0},{"$f":"'SUB. 6'!R30","v":0}]
[null,{"$f":"IF(C107=0,\"\",'SUB. 6'!B31)","v":"coentro"},{"$f":"'SUB. 6'!P31","v":336},{"$f":"IF(E107=0,\"\",'SUB. 6'!B31)","v":""},{"$f":"'SUB. 6'!H31","v":0},{"$f":"IF(G107=0,\"\",'SUB. 6'!B31)","v":"coentro"},{"$f":"'SUB. 6'!J31","v":192},{"$f":"'SUB. 6'!L31","v":144},{"$f":"'SUB. 6'!N31","v":0},{"$f":"'SUB. 6'!R31","v":0}]
[null,{"$f":"IF(C108=0,\"\",'SUB. 6'!B32)","v":""},{"$f":"'SUB. 6'!P32","v":0},{"$f":"IF(E108=0,\"\",'SUB. 6'!B32)","v":""},{"$f":"'SUB. 6'!H32","v":0},{"$f":"IF(G108=0,\"\",'SUB. 6'!B32)","v":"cebolinha"},{"$f":"'SUB. 6'!J32","v":144},{"$f":"'SUB. 6'!L32","v":108},{"$f":"'SUB. 6'!N32","v":0},{"$f":"'SUB. 6'!R32","v":0}]
[null,{"$f":"IF(C109=0,\"\",'SUB. 6'!B33)","v":""},{"$f":"'SUB. 6'!P33","v":0},{"$f":"IF(E109=0,\"\",'SUB. 6'!B33)","v":""},{"$f":"'SUB. 6'!H33","v":0},{"$f":"IF(G109=0,\"\",'SUB. 6'!B33)","v":""},{"$f":"'SUB. 6'!J33","v":0},{"$f":"'SUB. 6'!L33","v":0},{"$f":"'SUB. 6'!N33","v":0},{"$f":"'SUB. 6'!R33","v":0}]
[null,{"$f":"IF(C110=0,\"\",'SUB. 6'!B34)","v":""},{"$f":"'SUB. 6'!P34","v":0},{"$f":"IF(E110=0,\"\",'SUB. 6'!B34)","v":""},{"$f":"'SUB. 6'!H34","v":0},{"$f":"IF(G110=0,\"\",'SUB. 6'!B34)","v":""},{"$f":"'SUB. 6'!J34","v":0},{"$f":"'SUB. 6'!L34","v":0},{"$f":"'SUB. 6'!N34","v":0},{"$f":"'SUB. 6'!R34","v":0}]
[null,{"$f":"IF(C111=0,\"\",'SUB. 6'!B35)","v":""},{"$f":"'SUB. 6'!P35","v":0},{"$f":"IF(E111=0,\"\",'SUB. 6'!B35)","v":""},{"$f":"'SUB. 6'!H35","v":0},{"$f":"IF(G111=0,\"\",'SUB. 6'!B35)","v":""},{"$f":"'SUB. 6'!J35","v":0},{"$f":"'SUB. 6'!L35","v":0},{"$f":"'SUB. 6'!N35","v":0},{"$f":"'SUB. 6'!R35","v":0}]
[null,{"$f":"IF(C112=0,\"\",'SUB. 6'!B36)","v":""},{"$f":"'SUB. 6'!P36","v":0},{"$f":"'SUB. 6'!D36:F36","v":0},{"$f":"'SUB. 6'!H36","v":0},{"$f":"IF(G112=0,\"\",'SUB. 6'!B36)","v":""},{"$f":"'SUB. 6'!J36","v":0},{"$f":"'SUB. 6'!L36","v":0},{"$f":"'SUB. 6'!N36","v":0},{"$f":"'SUB. 6'!R36","v":0}]
["SUBSISTEMA 7",{"$f":"IF(C113=0,\"\",'SUB. 7'!B19)","v":""},{"$f":"'SUB. 7'!P19","v":0},{"$f":"IF(E113=0,\"\",'SUB. 7'!B19)","v":""},{"$f":"'SUB. 7'!H19","v":0},{"$f":"IF(G113=0,\"\",'SUB. 7'!B19)","v":""},{"$f":"'SUB. 7'!J19","v":0},{"$f":"'SUB. 7'!L19","v":0},{"$f":"'SUB. 7'!N19","v":0},{"$f":"'SUB. 7'!R19","v":0}]
[null,{"$f":"IF(C114=0,\"\",'SUB. 7'!B20)","v":""},{"$f":"'SUB. 7'!P20","v":0},{"$f":"IF(E114=0,\"\",'SUB. 7'!B20)","v":""},{"$f":"'SUB. 7'!H20","v":0},{"$f":"IF(G114=0,\"\",'SUB. 7'!B20)","v":""},{"$f":"'SUB. 7'!J20","v":0},{"$f":"'SUB. 7'!L20","v":0},{"$f":"'SUB. 7'!N20","v":0},{"$f":"'SUB. 7'!R20","v":0}]
[null,{"$f":"IF(C115=0,\"\",'SUB. 7'!B21)","v":""},{"$f":"'SUB. 7'!P21","v":0},{"$f":"IF(E115=0,\"\",'SUB. 7'!B21)","v":""},{"$f":"'SUB. 7'!H21","v":0},{"$f":"IF(G115=0,\"\",'SUB. 7'!B21)","v":""},{"$f":"'SUB. 7'!J21","v":0},{"$f":"'SUB. 7'!L21","v":0},{"$f":"'SUB. 7'!N21","v":0},{"$f":"'SUB. 7'!R21","v":0}]
[null,{"$f":"IF(C116=0,\"\",'SUB. 7'!B22)","v":""},{"$f":"'SUB. 7'!P22","v":0},{"$f":"IF(E116=0,\"\",'SUB. 7'!B22)","v":""},{"$f":"'SUB. 7'!H22","v":0},{"$f":"IF(G116=0,\"\",'SUB. 7'!B22)","v":""},{"$f":"'SUB. 7'!J22","v":0},{"$f":"'SUB. 7'!L22","v":0},{"$f":"'SUB. 7'!N22","v":0},{"$f":"'SUB. 7'!R22","v":0}]
[null,{"$f":"IF(C117=0,\"\",'SUB. 7'!B23)","v":""},{"$f":"'SUB. 7'!P23","v":0},{"$f":"IF(E117=0,\"\",'SUB. 7'!B23)","v":""},{"$f":"'SUB. 7'!H23","v":0},{"$f":"IF(G117=0,\"\",'SUB. 7'!B23)","v":""},{"$f":"'SUB. 7'!J23","v":0},{"$f":"'SUB. 7'!L23","v":0},{"$f":"'SUB. 7'!N23","v":0},{"$f":"'SUB. 7'!R23","v":0}]
[null,{"$f":"IF(C118=0,\"\",'SUB. 7'!B24)","v":""},{"$f":"'SUB. 7'!P24","v":0},{"$f":"IF(E118=0,\"\",'SUB. 7'!B24)","v":""},{"$f":"'SUB. 7'!H24","v":0},{"$f":"IF(G118=0,\"\",'SUB. 7'!B24)","v":""},{"$f":"'SUB. 7'!J24","v":0},{"$f":"'SUB. 7'!L24","v":0},{"$f":"'SUB. 7'!N24","v":0},{"$f":"'SUB. 7'!R24","v":0}]
[null,{"$f":"IF(C119=0,\"\",'SUB. 7'!B25)","v":""},{"$f":"'SUB. 7'!P25","v":0},{"$f":"IF(E119=0,\"\",'SUB. 7'!B25)","v":""},{"$f":"'SUB. 7'!H25","v":0},{"$f":"IF(G119=0,\"\",'SUB. 7'!B25)","v":""},{"$f":"'SUB. 7'!J25","v":0},{"$f":"'SUB. 7'!L25","v":0},{"$f":"'SUB. 7'!N25","v":0},{"$f":"'SUB. 7'!R25","v":0}]
[null,{"$f":"IF(C120=0,\"\",'SUB. 7'!B26)","v":""},{"$f":"'SUB. 7'!P26","v":0},{"$f":"IF(E120=0,\"\",'SUB. 7'!B26)","v":""},{"$f":"'SUB. 7'!H26","v":0},{"$f":"IF(G120=0,\"\",'SUB. 7'!B26)","v":""},{"$f":"'SUB. 7'!J26","v":0},{"$f":"'SUB. 7'!L26","v":0},{"$f":"'SUB. 7'!N26","v":0},{"$f":"'SUB. 7'!R26","v":0}]
[null,{"$f":"IF(C121=0,\"\",'SUB. 7'!B27)","v":""},{"$f":"'SUB. 7'!P27","v":0},{"$f":"IF(E121=0,\"\",'SUB. 7'!B27)","v":""},{"$f":"'SUB. 7'!H27","v":0},{"$f":"IF(G121=0,\"\",'SUB. 7'!B27)","v":""},{"$f":"'SUB. 7'!J27","v":0},{"$f":"'SUB. 7'!L27","v":0},{"$f":"'SUB. 7'!N27","v":0},{"$f":"'SUB. 7'!R27","v":0}]
[null,{"$f":"IF(C122=0,\"\",'SUB. 7'!B28)","v":""},{"$f":"'SUB. 7'!P28","v":0},{"$f":"IF(E122=0,\"\",'SUB. 7'!B28)","v":""},{"$f":"'SUB. 7'!H28","v":0},{"$f":"IF(G122=0,\"\",'SUB. 7'!B28)","v":""},{"$f":"'SUB. 7'!J28","v":0},{"$f":"'SUB. 7'!L28","v":0},{"$f":"'SUB. 7'!N28","v":0},{"$f":"'SUB. 7'!R28","v":0}]
[null,{"$f":"IF(C123=0,\"\",'SUB. 7'!B29)","v":""},{"$f":"'SUB. 7'!P29","v":0},{"$f":"IF(E123=0,\"\",'SUB. 7'!B29)","v":""},{"$f":"'SUB. 7'!H29","v":0},{"$f":"IF(G123=0,\"\",'SUB. 7'!B29)","v":""},{"$f":"'SUB. 7'!J29","v":0},{"$f":"'SUB. 7'!L29","v":0},{"$f":"'SUB. 7'!N29","v":0},{"$f":"'SUB. 7'!R29","v":0}]
[null,{"$f":"IF(C124=0,\"\",'SUB. 7'!B30)","v":""},{"$f":"'SUB. 7'!P30","v":0},{"$f":"IF(E124=0,\"\",'SUB. 7'!B30)","v":""},{"$f":"'SUB. 7'!H30","v":0},{"$f":"IF(G124=0,\"\",'SUB. 7'!B30)","v":""},{"$f":"'SUB. 7'!J30","v":0},{"$f":"'SUB. 7'!L30","v":0},{"$f":"'SUB. 7'!N30","v":0},{"$f":"'SUB. 7'!R30","v":0}]
[null,{"$f":"IF(C125=0,\"\",'SUB. 7'!B31)","v":""},{"$f":"'SUB. 7'!P31","v":0},{"$f":"IF(E125=0,\"\",'SUB. 7'!B31)","v":""},{"$f":"'SUB. 7'!H31","v":0},{"$f":"IF(G125=0,\"\",'SUB. 7'!B31)","v":""},{"$f":"'SUB. 7'!J31","v":0},{"$f":"'SUB. 7'!L31","v":0},{"$f":"'SUB. 7'!N31","v":0},{"$f":"'SUB. 7'!R31","v":0}]
[null,{"$f":"IF(C126=0,\"\",'SUB. 7'!B32)","v":""},{"$f":"'SUB. 7'!P32","v":0},{"$f":"IF(E126=0,\"\",'SUB. 7'!B32)","v":""},{"$f":"'SUB. 7'!H32","v":0},{"$f":"IF(G126=0,\"\",'SUB. 7'!B32)","v":""},{"$f":"'SUB. 7'!J32","v":0},{"$f":"'SUB. 7'!L32","v":0},{"$f":"'SUB. 7'!N32","v":0},{"$f":"'SUB. 7'!R32","v":0}]
[null,{"$f":"IF(C127=0,\"\",'SUB. 7'!B33)","v":""},{"$f":"'SUB. 7'!P33","v":0},{"$f":"IF(E127=0,\"\",'SUB. 7'!B33)","v":""},{"$f":"'SUB. 7'!H33","v":0},{"$f":"IF(G127=0,\"\",'SUB. 7'!B33)","v":""},{"$f":"'SUB. 7'!J33","v":0},{"$f":"'SUB. 7'!L33","v":0},{"$f":"'SUB. 7'!N33","v":0},{"$f":"'SUB. 7'!R33","v":0}]
[null,{"$f":"IF(C128=0,\"\",'SUB. 7'!B34)","v":""},{"$f":"'SUB. 7'!P34","v":0},{"$f":"IF(E128=0,\"\",'SUB. 7'!B34)","v":""},{"$f":"'SUB. 7'!H34","v":0},{"$f":"IF(G128=0,\"\",'SUB. 7'!B34)","v":""},{"$f":"'SUB. 7'!J34","v":0},{"$f":"'SUB. 7'!L34","v":0},{"$f":"'SUB. 7'!N34","v":0},{"$f":"'SUB. 7'!R34","v":0}]
[null,{"$f":"IF(C129=0,\"\",'SUB. 7'!B35)","v":""},{"$f":"'SUB. 7'!P35","v":0},{"$f":"IF(E129=0,\"\",'SUB. 7'!B35)","v":""},{"$f":"'SUB. 7'!H35","v":0},{"$f":"IF(G129=0,\"\",'SUB. 7'!B35)","v":""},{"$f":"'SUB. 7'!J35","v":0},{"$f":"'SUB. 7'!L35","v":0},{"$f":"'SUB. 7'!N35","v":0},{"$f":"'SUB. 7'!R35","v":0}]
[null,{"$f":"IF(C130=0,\"\",'SUB. 7'!B36)","v":""},{"$f":"'SUB. 7'!P36","v":0},{"$f":"IF(E130=0,\"\",'SUB. 7'!B36)","v":""},{"$f":"'SUB. 7'!H36","v":0},{"$f":"IF(G130=0,\"\",'SUB. 7'!B36)","v":""},{"$f":"'SUB. 7'!J36","v":0},{"$f":"'SUB. 7'!L36","v":0},{"$f":"'SUB. 7'!N36","v":0},{"$f":"'SUB. 7'!R36","v":0}]
["SUBSISTEMA 8",{"$f":"IF(C131=0,\"\",'SUB. 8'!B19)","v":""},{"$f":"'SUB. 8'!P19","v":0},{"$f":"IF(E131=0,\"\",'SUB. 8'!B19)","v":""},{"$f":"'SUB. 8'!H19","v":0},{"$f":"IF(G131=0,\"\",'SUB. 8'!B19)","v":""},{"$f":"'SUB. 8'!J19","v":0},{"$f":"'SUB. 8'!L19","v":0},{"$f":"'SUB. 8'!N19","v":0},{"$f":"'SUB. 8'!R19","v":0}]
[null,{"$f":"IF(C132=0,\"\",'SUB. 8'!B20)","v":""},{"$f":"'SUB. 8'!P20","v":0},{"$f":"IF(E132=0,\"\",'SUB. 8'!B20)","v":""},{"$f":"'SUB. 8'!H20","v":0},{"$f":"IF(G132=0,\"\",'SUB. 8'!B20)","v":""},{"$f":"'SUB. 8'!J20","v":0},{"$f":"'SUB. 8'!L20","v":0},{"$f":"'SUB. 8'!N20","v":0},{"$f":"'SUB. 8'!R20","v":0}]
[null,{"$f":"IF(C133=0,\"\",'SUB. 8'!B21)","v":""},{"$f":"'SUB. 8'!P21","v":0},{"$f":"IF(E133=0,\"\",'SUB. 8'!B21)","v":""},{"$f":"'SUB. 8'!H21","v":0},{"$f":"IF(G133=0,\"\",'SUB. 8'!B21)","v":""},{"$f":"'SUB. 8'!J21","v":0},{"$f":"'SUB. 8'!L21","v":0},{"$f":"'SUB. 8'!N21","v":0},{"$f":"'SUB. 8'!R21","v":0}]
[null,{"$f":"IF(C134=0,\"\",'SUB. 8'!B22)","v":""},{"$f":"'SUB. 8'!P22","v":0},{"$f":"IF(E134=0,\"\",'SUB. 8'!B22)","v":""},{"$f":"'SUB. 8'!H22","v":0},{"$f":"IF(G134=0,\"\",'SUB. 8'!B22)","v":""},{"$f":"'SUB. 8'!J22","v":0},{"$f":"'SUB. 8'!L22","v":0},{"$f":"'SUB. 8'!N22","v":0},{"$f":"'SUB. 8'!R22","v":0}]
[null,{"$f":"IF(C135=0,\"\",'SUB. 8'!B23)","v":""},{"$f":"'SUB. 8'!P23","v":0},{"$f":"IF(E135=0,\"\",'SUB. 8'!B23)","v":""},{"$f":"'SUB. 8'!H23","v":0},{"$f":"IF(G135=0,\"\",'SUB. 8'!B23)","v":""},{"$f":"'SUB. 8'!J23","v":0},{"$f":"'SUB. 8'!L23","v":0},{"$f":"'SUB. 8'!N23","v":0},{"$f":"'SUB. 8'!R23","v":0}]
[null,{"$f":"IF(C136=0,\"\",'SUB. 8'!B24)","v":""},{"$f":"'SUB. 8'!P24","v":0},{"$f":"IF(E136=0,\"\",'SUB. 8'!B24)","v":""},{"$f":"'SUB. 8'!H24","v":0},{"$f":"IF(G136=0,\"\",'SUB. 8'!B24)","v":""},{"$f":"'SUB. 8'!J24","v":0},{"$f":"'SUB. 8'!L24","v":0},{"$f":"'SUB. 8'!N24","v":0},{"$f":"'SUB. 8'!R24","v":0}]
[null,{"$f":"IF(C137=0,\"\",'SUB. 8'!B25)","v":""},{"$f":"'SUB. 8'!P25","v":0},{"$f":"IF(E137=0,\"\",'SUB. 8'!B25)","v":""},{"$f":"'SUB. 8'!H25","v":0},{"$f":"IF(G137=0,\"\",'SUB. 8'!B25)","v":""},{"$f":"'SUB. 8'!J25","v":0},{"$f":"'SUB. 8'!L25","v":0},{"$f":"'SUB. 8'!N25","v":0},{"$f":"'SUB. 8'!R25","v":0}]
[null,{"$f":"IF(C138=0,\"\",'SUB. 8'!B26)","v":""},{"$f":"'SUB. 8'!P26","v":0},{"$f":"IF(E138=0,\"\",'SUB. 8'!B26)","v":""},{"$f":"'SUB. 8'!H26","v":0},{"$f":"IF(G138=0,\"\",'SUB. 8'!B26)","v":""},{"$f":"'SUB. 8'!J26","v":0},{"$f":"'SUB. 8'!L26","v":0},{"$f":"'SUB. 8'!N26","v":0},{"$f":"'SUB. 8'!R26","v":0}]
[null,{"$f":"IF(C139=0,\"\",'SUB. 8'!B27)","v":""},{"$f":"'SUB. 8'!P27","v":0},{"$f":"IF(E139=0,\"\",'SUB. 8'!B27)","v":""},{"$f":"'SUB. 8'!H27","v":0},{"$f":"IF(G139=0,\"\",'SUB. 8'!B27)","v":""},{"$f":"'SUB. 8'!J27","v":0},{"$f":"'SUB. 8'!L27","v":0},{"$f":"'SUB. 8'!N27","v":0},{"$f":"'SUB. 8'!R27","v":0}]
[null,{"$f":"IF(C140=0,\"\",'SUB. 8'!B28)","v":""},{"$f":"'SUB. 8'!P28","v":0},{"$f":"IF(E140=0,\"\",'SUB. 8'!B28)","v":""},{"$f":"'SUB. 8'!H28","v":0},{"$f":"IF(G140=0,\"\",'SUB. 8'!B28)","v":""},{"$f":"'SUB. 8'!J28","v":0},{"$f":"'SUB. 8'!L28","v":0},{"$f":"'SUB. 8'!N28","v":0},{"$f":"'SUB. 8'!R28","v":0}]
[null,{"$f":"IF(C141=0,\"\",'SUB. 8'!B29)","v":""},{"$f":"'SUB. 8'!P29","v":0},{"$f":"IF(E141=0,\"\",'SUB. 8'!B29)","v":""},{"$f":"'SUB. 8'!H29","v":0},{"$f":"IF(G141=0,\"\",'SUB. 8'!B29)","v":""},{"$f":"'SUB. 8'!J29","v":0},{"$f":"'SUB. 8'!L29","v":0},{"$f":"'SUB. 8'!N29","v":0},{"$f":"'SUB. 8'!R29","v":0}]
[null,{"$f":"IF(C142=0,\"\",'SUB. 8'!B30)","v":""},{"$f":"'SUB. 8'!P30","v":0},{"$f":"IF(E142=0,\"\",'SUB. 8'!B30)","v":""},{"$f":"'SUB. 8'!H30","v":0},{"$f":"IF(G142=0,\"\",'SUB. 8'!B30)","v":""},{"$f":"'SUB. 8'!J30","v":0},{"$f":"'SUB. 8'!L30","v":0},{"$f":"'SUB. 8'!N30","v":0},{"$f":"'SUB. 8'!R30","v":0}]
[null,{"$f":"IF(C143=0,\"\",'SUB. 8'!B31)","v":""},{"$f":"'SUB. 8'!P31","v":0},{"$f":"IF(E143=0,\"\",'SUB. 8'!B31)","v":""},{"$f":"'SUB. 8'!H31","v":0},{"$f":"IF(G143=0,\"\",'SUB. 8'!B31)","v":""},{"$f":"'SUB. 8'!J31","v":0},{"$f":"'SUB. 8'!L31","v":0},{"$f":"'SUB. 8'!N31","v":0},{"$f":"'SUB. 8'!R31","v":0}]
[null,{"$f":"IF(C144=0,\"\",'SUB. 8'!B32)","v":""},{"$f":"'SUB. 8'!P32","v":0},{"$f":"IF(E144=0,\"\",'SUB. 8'!B32)","v":""},{"$f":"'SUB. 8'!H32","v":0},{"$f":"IF(G144=0,\"\",'SUB. 8'!B32)","v":""},{"$f":"'SUB. 8'!J32","v":0},{"$f":"'SUB. 8'!L32","v":0},{"$f":"'SUB. 8'!N32","v":0},{"$f":"'SUB. 8'!R32","v":0}]
[null,{"$f":"IF(C145=0,\"\",'SUB. 8'!B33)","v":""},{"$f":"'SUB. 8'!P33","v":0},{"$f":"IF(E145=0,\"\",'SUB. 8'!B33)","v":""},{"$f":"'SUB. 8'!H33","v":0},{"$f":"IF(G145=0,\"\",'SUB. 8'!B33)","v":""},{"$f":"'SUB. 8'!J33","v":0},{"$f":"'SUB. 8'!L33","v":0},{"$f":"'SUB. 8'!N33","v":0},{"$f":"'SUB. 8'!R33","v":0}]
[null,{"$f":"IF(C146=0,\"\",'SUB. 8'!B34)","v":""},{"$f":"'SUB. 8'!P34","v":0},{"$f":"IF(E146=0,\"\",'SUB. 8'!B34)","v":""},{"$f":"'SUB. 8'!H34","v":0},{"$f":"IF(G146=0,\"\",'SUB. 8'!B34)","v":""},{"$f":"'SUB. 8'!J34","v":0},{"$f":"'SUB. 8'!L34","v":0},{"$f":"'SUB. 8'!N34","v":0},{"$f":"'SUB. 8'!R34","v":0}]
[null,{"$f":"IF(C147=0,\"\",'SUB. 8'!B35)","v":""},{"$f":"'SUB. 8'!P35","v":0},{"$f":"IF(E147=0,\"\",'SUB. 8'!B35)","v":""},{"$f":"'SUB. 8'!H35","v":0},{"$f":"IF(G147=0,\"\",'SUB. 8'!B35)","v":""},{"$f":"'SUB. 8'!J35","v":0},{"$f":"'SUB. 8'!L35","v":0},{"$f":"'SUB. 8'!N35","v":0},{"$f":"'SUB. 8'!R35","v":0}]
[null,{"$f":"IF(C148=0,\"\",'SUB. 8'!B36)","v":""},{"$f":"'SUB. 8'!P36","v":0},{"$f":"IF(E148=0,\"\",'SUB. 8'!B36)","v":""},{"$f":"'SUB. 8'!H36","v":0},{"$f":"IF(G148=0,\"\",'SUB. 8'!B36)","v":""},{"$f":"'SUB. 8'!J36","v":0},{"$f":"'SUB. 8'!L36","v":0},{"$f":"'SUB. 8'!N36","v":0},{"$f":"'SUB. 8'!R36","v":0}]
["SUBSISTEMA 9",{"$f":"IF(C149=0,\"\",'SUB. 9'!B19)","v":""},{"$f":"'SUB. 9'!P19","v":0},{"$f":"IF(E149=0,\"\",'SUB. 9'!B19)","v":""},{"$f":"'SUB. 9'!H19","v":0},{"$f":"IF(G149=0,\"\",'SUB. 9'!B19)","v":""},{"$f":"'SUB. 9'!J19","v":0},{"$f":"'SUB. 9'!L19","v":0},{"$f":"'SUB. 9'!N19","v":0},{"$f":"'SUB. 9'!R19","v":0},null,null,"Dados",null,null,null,null,null,"Dados"]
[null,{"$f":"IF(C150=0,\"\",'SUB. 9'!B20)","v":""},{"$f":"'SUB. 9'!P20","v":0},{"$f":"IF(E150=0,\"\",'SUB. 9'!B20)","v":""},{"$f":"'SUB. 9'!H20","v":0},{"$f":"IF(G150=0,\"\",'SUB. 9'!B20)","v":""},{"$f":"'SUB. 9'!J20","v":0},{"$f":"'SUB. 9'!L20","v":0},{"$f":"'SUB. 9'!N20","v":0},{"$f":"'SUB. 9'!R20","v":0},null,null,"Produções.","Soma de Venda","Soma de Autoconsumo","Soma de Doações trocas",null,null,"Produções.","Soma de Venda","Soma de Autoconsumo","Soma de Doações trocas"]
[null,{"$f":"IF(C151=0,\"\",'SUB. 9'!B21)","v":""},{"$f":"'SUB. 9'!P21","v":0},{"$f":"IF(E151=0,\"\",'SUB. 9'!B21)","v":""},{"$f":"'SUB. 9'!H21","v":0},{"$f":"IF(G151=0,\"\",'SUB. 9'!B21)","v":""},{"$f":"'SUB. 9'!J21","v":0},{"$f":"'SUB. 9'!L21","v":0},{"$f":"'SUB. 9'!N21","v":0},{"$f":"'SUB. 9'!R21","v":0},null,"Total",0,18656.800100000004,3660.2,1052.6666666666665,null,"Total",0,18656.800100000004,3660.2,1052.6666666666665]
[null,{"$f":"IF(C152=0,\"\",'SUB. 9'!B22)","v":""},{"$f":"'SUB. 9'!P22","v":0},{"$f":"IF(E152=0,\"\",'SUB. 9'!B22)","v":""},{"$f":"'SUB. 9'!H22","v":0},{"$f":"IF(G152=0,\"\",'SUB. 9'!B22)","v":""},{"$f":"'SUB. 9'!J22","v":0},{"$f":"'SUB. 9'!L22","v":0},{"$f":"'SUB. 9'!N22","v":0},{"$f":"'SUB. 9'!R22","v":0}]
[null,{"$f":"IF(C153=0,\"\",'SUB. 9'!B23)","v":""},{"$f":"'SUB. 9'!P23","v":0},{"$f":"IF(E153=0,\"\",'SUB. 9'!B23)","v":""},{"$f":"'SUB. 9'!H23","v":0},{"$f":"IF(G153=0,\"\",'SUB. 9'!B23)","v":""},{"$f":"'SUB. 9'!J23","v":0},{"$f":"'SUB. 9'!L23","v":0},{"$f":"'SUB. 9'!N23","v":0},{"$f":"'SUB. 9'!R23","v":0}]
[null,{"$f":"IF(C154=0,\"\",'SUB. 9'!B24)","v":""},{"$f":"'SUB. 9'!P24","v":0},{"$f":"IF(E154=0,\"\",'SUB. 9'!B24)","v":""},{"$f":"'SUB. 9'!H24","v":0},{"$f":"IF(G154=0,\"\",'SUB. 9'!B24)","v":""},{"$f":"'SUB. 9'!J24","v":0},{"$f":"'SUB. 9'!L24","v":0},{"$f":"'SUB. 9'!N24","v":0},{"$f":"'SUB. 9'!R24","v":0}]
[null,{"$f":"IF(C155=0,\"\",'SUB. 9'!B25)","v":""},{"$f":"'SUB. 9'!P25","v":0},{"$f":"IF(E155=0,\"\",'SUB. 9'!B25)","v":""},{"$f":"'SUB. 9'!H25","v":0},{"$f":"IF(G155=0,\"\",'SUB. 9'!B25)","v":""},{"$f":"'SUB. 9'!J25","v":0},{"$f":"'SUB. 9'!L25","v":0},{"$f":"'SUB. 9'!N25","v":0},{"$f":"'SUB. 9'!R25","v":0}]
[null,{"$f":"IF(C156=0,\"\",'SUB. 9'!B26)","v":""},{"$f":"'SUB. 9'!P26","v":0},{"$f":"IF(E156=0,\"\",'SUB. 9'!B26)","v":""},{"$f":"'SUB. 9'!H26","v":0},{"$f":"IF(G156=0,\"\",'SUB. 9'!B26)","v":""},{"$f":"'SUB. 9'!J26","v":0},{"$f":"'SUB. 9'!L26","v":0},{"$f":"'SUB. 9'!N26","v":0},{"$f":"'SUB. 9'!R26","v":0}]
[null,{"$f":"IF(C157=0,\"\",'SUB. 9'!B27)","v":""},{"$f":"'SUB. 9'!P27","v":0},{"$f":"IF(E157=0,\"\",'SUB. 9'!B27)","v":""},{"$f":"'SUB. 9'!H27","v":0},{"$f":"IF(G157=0,\"\",'SUB. 9'!B27)","v":""},{"$f":"'SUB. 9'!J27","v":0},{"$f":"'SUB. 9'!L27","v":0},{"$f":"'SUB. 9'!N27","v":0},{"$f":"'SUB. 9'!R27","v":0}]
[null,{"$f":"IF(C158=0,\"\",'SUB. 9'!B28)","v":""},{"$f":"'SUB. 9'!P28","v":0},{"$f":"IF(E158=0,\"\",'SUB. 9'!B28)","v":""},{"$f":"'SUB. 9'!H28","v":0},{"$f":"IF(G158=0,\"\",'SUB. 9'!B28)","v":""},{"$f":"'SUB. 9'!J28","v":0},{"$f":"'SUB. 9'!L28","v":0},{"$f":"'SUB. 9'!N28","v":0},{"$f":"'SUB. 9'!R28","v":0}]
[null,{"$f":"IF(C159=0,\"\",'SUB. 9'!B29)","v":""},{"$f":"'SUB. 9'!P29","v":0},{"$f":"IF(E159=0,\"\",'SUB. 9'!B29)","v":""},{"$f":"'SUB. 9'!H29","v":0},{"$f":"IF(G159=0,\"\",'SUB. 9'!B29)","v":""},{"$f":"'SUB. 9'!J29","v":0},{"$f":"'SUB. 9'!L29","v":0},{"$f":"'SUB. 9'!N29","v":0},{"$f":"'SUB. 9'!R29","v":0}]
[null,{"$f":"IF(C160=0,\"\",'SUB. 9'!B30)","v":""},{"$f":"'SUB. 9'!P30","v":0},{"$f":"IF(E160=0,\"\",'SUB. 9'!B30)","v":""},{"$f":"'SUB. 9'!H30","v":0},{"$f":"IF(G160=0,\"\",'SUB. 9'!B30)","v":""},{"$f":"'SUB. 9'!J30","v":0},{"$f":"'SUB. 9'!L30","v":0},{"$f":"'SUB. 9'!N30","v":0},{"$f":"'SUB. 9'!R30","v":0}]
[null,{"$f":"IF(C161=0,\"\",'SUB. 9'!B31)","v":""},{"$f":"'SUB. 9'!P31","v":0},{"$f":"IF(E161=0,\"\",'SUB. 9'!B31)","v":""},{"$f":"'SUB. 9'!H31","v":0},{"$f":"IF(G161=0,\"\",'SUB. 9'!B31)","v":""},{"$f":"'SUB. 9'!J31","v":0},{"$f":"'SUB. 9'!L31","v":0},{"$f":"'SUB. 9'!N31","v":0},{"$f":"'SUB. 9'!R31","v":0}]
[null,{"$f":"IF(C162=0,\"\",'SUB. 9'!B32)","v":""},{"$f":"'SUB. 9'!P32","v":0},{"$f":"IF(E162=0,\"\",'SUB. 9'!B32)","v":""},{"$f":"'SUB. 9'!H32","v":0},{"$f":"IF(G162=0,\"\",'SUB. 9'!B32)","v":""},{"$f":"'SUB. 9'!J32","v":0},{"$f":"'SUB. 9'!L32","v":0},{"$f":"'SUB. 9'!N32","v":0},{"$f":"'SUB. 9'!R32","v":0}]
[null,{"$f":"IF(C163=0,\"\",'SUB. 9'!B33)","v":""},{"$f":"'SUB. 9'!P33","v":0},{"$f":"IF(E163=0,\"\",'SUB. 9'!B33)","v":""},{"$f":"'SUB. 9'!H33","v":0},{"$f":"IF(G163=0,\"\",'SUB. 9'!B33)","v":""},{"$f":"'SUB. 9'!J33","v":0},{"$f":"'SUB. 9'!L33","v":0},{"$f":"'SUB. 9'!N33","v":0},{"$f":"'SUB. 9'!R33","v":0}]
[null,{"$f":"IF(C164=0,\"\",'SUB. 9'!B34)","v":""},{"$f":"'SUB. 9'!P34","v":0},{"$f":"IF(E164=0,\"\",'SUB. 9'!B34)","v":""},{"$f":"'SUB. 9'!H34","v":0},{"$f":"IF(G164=0,\"\",'SUB. 9'!B34)","v":""},{"$f":"'SUB. 9'!J34","v":0},{"$f":"'SUB. 9'!L34","v":0},{"$f":"'SUB. 9'!N34","v":0},{"$f":"'SUB. 9'!R34","v":0}]
[null,{"$f":"IF(C165=0,\"\",'SUB. 9'!B35)","v":""},{"$f":"'SUB. 9'!P35","v":0},{"$f":"IF(E165=0,\"\",'SUB. 9'!B35)","v":""},{"$f":"'SUB. 9'!H35","v":0},{"$f":"IF(G165=0,\"\",'SUB. 9'!B35)","v":""},{"$f":"'SUB. 9'!J35","v":0},{"$f":"'SUB. 9'!L35","v":0},{"$f":"'SUB. 9'!N35","v":0},{"$f":"'SUB. 9'!R35","v":0}]
[null,{"$f":"IF(C166=0,\"\",'SUB. 9'!B36)","v":""},{"$f":"'SUB. 9'!P36","v":0},{"$f":"IF(E166=0,\"\",'SUB. 9'!B36)","v":""},{"$f":"'SUB. 9'!H36","v":0},{"$f":"IF(G166=0,\"\",'SUB. 9'!B36)","v":""},{"$f":"'SUB. 9'!J36","v":0},{"$f":"'SUB. 9'!L36","v":0},{"$f":"'SUB. 9'!N36","v":0},{"$f":"'SUB. 9'!R36","v":0}]
["SUBSISTEMA 10",{"$f":"IF(C167=0,\"\",'SUB. 10'!B19)","v":""},{"$f":"'SUB. 10'!P19","v":0},{"$f":"IF(E167=0,\"\",'SUB. 10'!B19)","v":""},{"$f":"'SUB. 10'!H19","v":0},{"$f":"IF(G167=0,\"\",'SUB. 10'!B19)","v":""},{"$f":"'SUB. 10'!J19","v":0},{"$f":"'SUB. 10'!L19","v":0},{"$f":"'SUB. 10'!N19","v":0},{"$f":"'SUB. 10'!R19","v":0}]
[null,{"$f":"IF(C168=0,\"\",'SUB. 10'!B20)","v":""},{"$f":"'SUB. 10'!P20","v":0},{"$f":"IF(E168=0,\"\",'SUB. 10'!B20)","v":""},{"$f":"'SUB. 10'!H20","v":0},{"$f":"IF(G168=0,\"\",'SUB. 10'!B20)","v":""},{"$f":"'SUB. 10'!J20","v":0},{"$f":"'SUB. 10'!L20","v":0},{"$f":"'SUB. 10'!N20","v":0},{"$f":"'SUB. 10'!R20","v":0}]
[null,{"$f":"IF(C169=0,\"\",'SUB. 10'!B21)","v":""},{"$f":"'SUB. 10'!P21","v":0},{"$f":"IF(E169=0,\"\",'SUB. 10'!B21)","v":""},{"$f":"'SUB. 10'!H21","v":0},{"$f":"IF(G169=0,\"\",'SUB. 10'!B21)","v":""},{"$f":"'SUB. 10'!J21","v":0},{"$f":"'SUB. 10'!L21","v":0},{"$f":"'SUB. 10'!N21","v":0},{"$f":"'SUB. 10'!R21","v":0}]
[null,{"$f":"IF(C170=0,\"\",'SUB. 10'!B22)","v":""},{"$f":"'SUB. 10'!P22","v":0},{"$f":"IF(E170=0,\"\",'SUB. 10'!B22)","v":""},{"$f":"'SUB. 10'!H22","v":0},{"$f":"IF(G170=0,\"\",'SUB. 10'!B22)","v":""},{"$f":"'SUB. 10'!J22","v":0},{"$f":"'SUB. 10'!L22","v":0},{"$f":"'SUB. 10'!N22","v":0},{"$f":"'SUB. 10'!R22","v":0}]
[null,{"$f":"IF(C171=0,\"\",'SUB. 10'!B23)","v":""},{"$f":"'SUB. 10'!P23","v":0},{"$f":"IF(E171=0,\"\",'SUB. 10'!B23)","v":""},{"$f":"'SUB. 10'!H23","v":0},{"$f":"IF(G171=0,\"\",'SUB. 10'!B23)","v":""},{"$f":"'SUB. 10'!J23","v":0},{"$f":"'SUB. 10'!L23","v":0},{"$f":"'SUB. 10'!N23","v":0},{"$f":"'SUB. 10'!R23","v":0}]
[null,{"$f":"IF(C172=0,\"\",'SUB. 10'!B24)","v":""},{"$f":"'SUB. 10'!P24","v":0},{"$f":"IF(E172=0,\"\",'SUB. 10'!B24)","v":""},{"$f":"'SUB. 10'!H24","v":0},{"$f":"IF(G172=0,\"\",'SUB. 10'!B24)","v":""},{"$f":"'SUB. 10'!J24","v":0},{"$f":"'SUB. 10'!L24","v":0},{"$f":"'SUB. 10'!N24","v":0},{"$f":"'SUB. 10'!R24","v":0}]
[null,{"$f":"IF(C173=0,\"\",'SUB. 10'!B25)","v":""},{"$f":"'SUB. 10'!P25","v":0},{"$f":"IF(E173=0,\"\",'SUB. 10'!B25)","v":""},{"$f":"'SUB. 10'!H25","v":0},{"$f":"IF(G173=0,\"\",'SUB. 10'!B25)","v":""},{"$f":"'SUB. 10'!J25","v":0},{"$f":"'SUB. 10'!L25","v":0},{"$f":"'SUB. 10'!N25","v":0},{"$f":"'SUB. 10'!R25","v":0}]
[null,{"$f":"IF(C174=0,\"\",'SUB. 10'!B26)","v":""},{"$f":"'SUB. 10'!P26","v":0},{"$f":"IF(E174=0,\"\",'SUB. 10'!B26)","v":""},{"$f":"'SUB. 10'!H26","v":0},{"$f":"IF(G174=0,\"\",'SUB. 10'!B26)","v":""},{"$f":"'SUB. 10'!J26","v":0},{"$f":"'SUB. 10'!L26","v":0},{"$f":"'SUB. 10'!N26","v":0},{"$f":"'SUB. 10'!R26","v":0}]
[null,{"$f":"IF(C175=0,\"\",'SUB. 10'!B27)","v":""},{"$f":"'SUB. 10'!P27","v":0},{"$f":"IF(E175=0,\"\",'SUB. 10'!B27)","v":""},{"$f":"'SUB. 10'!H27","v":0},{"$f":"IF(G175=0,\"\",'SUB. 10'!B27)","v":""},{"$f":"'SUB. 10'!J27","v":0},{"$f":"'SUB. 10'!L27","v":0},{"$f":"'SUB. 10'!N27","v":0},{"$f":"'SUB. 10'!R27","v":0}]
[null,{"$f":"IF(C176=0,\"\",'SUB. 10'!B28)","v":""},{"$f":"'SUB. 10'!P28","v":0},{"$f":"IF(E176=0,\"\",'SUB. 10'!B28)","v":""},{"$f":"'SUB. 10'!H28","v":0},{"$f":"IF(G176=0,\"\",'SUB. 10'!B28)","v":""},{"$f":"'SUB. 10'!J28","v":0},{"$f":"'SUB. 10'!L28","v":0},{"$f":"'SUB. 10'!N28","v":0},{"$f":"'SUB. 10'!R28","v":0}]
[null,{"$f":"IF(C177=0,\"\",'SUB. 10'!B29)","v":""},{"$f":"'SUB. 10'!P29","v":0},{"$f":"IF(E177=0,\"\",'SUB. 10'!B29)","v":""},{"$f":"'SUB. 10'!H29","v":0},{"$f":"IF(G177=0,\"\",'SUB. 10'!B29)","v":""},{"$f":"'SUB. 10'!J29","v":0},{"$f":"'SUB. 10'!L29","v":0},{"$f":"'SUB. 10'!N29","v":0},{"$f":"'SUB. 10'!R29","v":0}]
[null,{"$f":"IF(C178=0,\"\",'SUB. 10'!B30)","v":""},{"$f":"'SUB. 10'!P30","v":0},{"$f":"IF(E178=0,\"\",'SUB. 10'!B30)","v":""},{"$f":"'SUB. 10'!H30","v":0},{"$f":"IF(G178=0,\"\",'SUB. 10'!B30)","v":""},{"$f":"'SUB. 10'!J30","v":0},{"$f":"'SUB. 10'!L30","v":0},{"$f":"'SUB. 10'!N30","v":0},{"$f":"'SUB. 10'!R30","v":0}]
[null,{"$f":"IF(C179=0,\"\",'SUB. 10'!B31)","v":""},{"$f":"'SUB. 10'!P31","v":0},{"$f":"IF(E179=0,\"\",'SUB. 10'!B31)","v":""},{"$f":"'SUB. 10'!H31","v":0},{"$f":"IF(G179=0,\"\",'SUB. 10'!B31)","v":""},{"$f":"'SUB. 10'!J31","v":0},{"$f":"'SUB. 10'!L31","v":0},{"$f":"'SUB. 10'!N31","v":0},{"$f":"'SUB. 10'!R31","v":0}]
[null,{"$f":"IF(C180=0,\"\",'SUB. 10'!B32)","v":""},{"$f":"'SUB. 10'!P32","v":0},{"$f":"IF(E180=0,\"\",'SUB. 10'!B32)","v":""},{"$f":"'SUB. 10'!H32","v":0},{"$f":"IF(G180=0,\"\",'SUB. 10'!B32)","v":""},{"$f":"'SUB. 10'!J32","v":0},{"$f":"'SUB. 10'!L32","v":0},{"$f":"'SUB. 10'!N32","v":0},{"$f":"'SUB. 10'!R32","v":0}]
[null,{"$f":"IF(C181=0,\"\",'SUB. 10'!B33)","v":""},{"$f":"'SUB. 10'!P33","v":0},{"$f":"IF(E181=0,\"\",'SUB. 10'!B33)","v":""},{"$f":"'SUB. 10'!H33","v":0},{"$f":"IF(G181=0,\"\",'SUB. 10'!B33)","v":""},{"$f":"'SUB. 10'!J33","v":0},{"$f":"'SUB. 10'!L33","v":0},{"$f":"'SUB. 10'!N33","v":0},{"$f":"'SUB. 10'!R33","v":0}]
[null,{"$f":"IF(C182=0,\"\",'SUB. 10'!B34)","v":""},{"$f":"'SUB. 10'!P34","v":0},{"$f":"IF(E182=0,\"\",'SUB. 10'!B34)","v":""},{"$f":"'SUB. 10'!H34","v":0},{"$f":"IF(G182=0,\"\",'SUB. 10'!B34)","v":""},{"$f":"'SUB. 10'!J34","v":0},{"$f":"'SUB. 10'!L34","v":0},{"$f":"'SUB. 10'!N34","v":0},{"$f":"'SUB. 10'!R34","v":0}]
[null,{"$f":"IF(C183=0,\"\",'SUB. 10'!B35)","v":""},{"$f":"'SUB. 10'!P35","v":0},{"$f":"IF(E183=0,\"\",'SUB. 10'!B35)","v":""},{"$f":"'SUB. 10'!H35","v":0},{"$f":"IF(G183=0,\"\",'SUB. 10'!B35)","v":""},{"$f":"'SUB. 10'!J35","v":0},{"$f":"'SUB. 10'!L35","v":0},{"$f":"'SUB. 10'!N35","v":0},{"$f":"'SUB. 10'!R35","v":0}]
[null,{"$f":"IF(C184=0,\"\",'SUB. 10'!B36)","v":""},{"$f":"'SUB. 10'!P36","v":0},{"$f":"IF(E184=0,\"\",'SUB. 10'!B36)","v":""},{"$f":"'SUB. 10'!H36","v":0},{"$f":"IF(G184=0,\"\",'SUB. 10'!B36)","v":""},{"$f":"'SUB. 10'!J36","v":0},{"$f":"'SUB. 10'!L36","v":0},{"$f":"'SUB. 10'!N36","v":0},{"$f":"'SUB. 10'!R36","v":0}]
["SUBSISTEMA 11",{"$f":"IF(C185=0,\"\",'SUB. 11'!B19)","v":""},{"$f":"'SUB. 11'!P19","v":0},{"$f":"IF(E185=0,\"\",'SUB. 11'!B19)","v":""},{"$f":"'SUB. 11'!H19","v":0},{"$f":"IF(G185=0,\"\",'SUB. 11'!B19)","v":""},{"$f":"'SUB. 11'!J19","v":0},{"$f":"'SUB. 11'!L19","v":0},{"$f":"'SUB. 11'!N19","v":0},{"$f":"'SUB. 11'!R19","v":0}]
[null,{"$f":"IF(C186=0,\"\",'SUB. 11'!B20)","v":""},{"$f":"'SUB. 11'!P20","v":0},{"$f":"IF(E186=0,\"\",'SUB. 11'!B20)","v":""},{"$f":"'SUB. 11'!H20","v":0},{"$f":"IF(G186=0,\"\",'SUB. 11'!B20)","v":""},{"$f":"'SUB. 11'!J20","v":0},{"$f":"'SUB. 11'!L20","v":0},{"$f":"'SUB. 11'!N20","v":0},{"$f":"'SUB. 11'!R20","v":0}]
[null,{"$f":"IF(C187=0,\"\",'SUB. 11'!B21)","v":""},{"$f":"'SUB. 11'!P21","v":0},{"$f":"IF(E187=0,\"\",'SUB. 11'!B21)","v":""},{"$f":"'SUB. 11'!H21","v":0},{"$f":"IF(G187=0,\"\",'SUB. 11'!B21)","v":""},{"$f":"'SUB. 11'!J21","v":0},{"$f":"'SUB. 11'!L21","v":0},{"$f":"'SUB. 11'!N21","v":0},{"$f":"'SUB. 11'!R21","v":0}]
[null,{"$f":"IF(C188=0,\"\",'SUB. 11'!B22)","v":""},{"$f":"'SUB. 11'!P22","v":0},{"$f":"IF(E188=0,\"\",'SUB. 11'!B22)","v":""},{"$f":"'SUB. 11'!H22","v":0},{"$f":"IF(G188=0,\"\",'SUB. 11'!B22)","v":""},{"$f":"'SUB. 11'!J22","v":0},{"$f":"'SUB. 11'!L22","v":0},{"$f":"'SUB. 11'!N22","v":0},{"$f":"'SUB. 11'!R22","v":0}]
[null,{"$f":"IF(C189=0,\"\",'SUB. 11'!B23)","v":""},{"$f":"'SUB. 11'!P23","v":0},{"$f":"IF(E189=0,\"\",'SUB. 11'!B23)","v":""},{"$f":"'SUB. 11'!H23","v":0},{"$f":"IF(G189=0,\"\",'SUB. 11'!B23)","v":""},{"$f":"'SUB. 11'!J23","v":0},{"$f":"'SUB. 11'!L23","v":0},{"$f":"'SUB. 11'!N23","v":0},{"$f":"'SUB. 11'!R23","v":0}]
[null,{"$f":"IF(C190=0,\"\",'SUB. 11'!B24)","v":""},{"$f":"'SUB. 11'!P24","v":0},{"$f":"IF(E190=0,\"\",'SUB. 11'!B24)","v":""},{"$f":"'SUB. 11'!H24","v":0},{"$f":"IF(G190=0,\"\",'SUB. 11'!B24)","v":""},{"$f":"'SUB. 11'!J24","v":0},{"$f":"'SUB. 11'!L24","v":0},{"$f":"'SUB. 11'!N24","v":0},{"$f":"'SUB. 11'!R24","v":0}]
[null,{"$f":"IF(C191=0,\"\",'SUB. 11'!B25)","v":""},{"$f":"'SUB. 11'!P25","v":0},{"$f":"IF(E191=0,\"\",'SUB. 11'!B25)","v":""},{"$f":"'SUB. 11'!H25","v":0},{"$f":"IF(G191=0,\"\",'SUB. 11'!B25)","v":""},{"$f":"'SUB. 11'!J25","v":0},{"$f":"'SUB. 11'!L25","v":0},{"$f":"'SUB. 11'!N25","v":0},{"$f":"'SUB. 11'!R25","v":0}]
[null,{"$f":"IF(C192=0,\"\",'SUB. 11'!B26)","v":""},{"$f":"'SUB. 11'!P26","v":0},{"$f":"IF(E192=0,\"\",'SUB. 11'!B26)","v":""},{"$f":"'SUB. 11'!H26","v":0},{"$f":"IF(G192=0,\"\",'SUB. 11'!B26)","v":""},{"$f":"'SUB. 11'!J26","v":0},{"$f":"'SUB. 11'!L26","v":0},{"$f":"'SUB. 11'!N26","v":0},{"$f":"'SUB. 11'!R26","v":0}]
[null,{"$f":"IF(C193=0,\"\",'SUB. 11'!B27)","v":""},{"$f":"'SUB. 11'!P27","v":0},{"$f":"IF(E193=0,\"\",'SUB. 11'!B27)","v":""},{"$f":"'SUB. 11'!H27","v":0},{"$f":"IF(G193=0,\"\",'SUB. 11'!B27)","v":""},{"$f":"'SUB. 11'!J27","v":0},{"$f":"'SUB. 11'!L27","v":0},{"$f":"'SUB. 11'!N27","v":0},{"$f":"'SUB. 11'!R27","v":0}]
[null,{"$f":"IF(C194=0,\"\",'SUB. 11'!B28)","v":""},{"$f":"'SUB. 11'!P28","v":0},{"$f":"IF(E194=0,\"\",'SUB. 11'!B28)","v":""},{"$f":"'SUB. 11'!H28","v":0},{"$f":"IF(G194=0,\"\",'SUB. 11'!B28)","v":""},{"$f":"'SUB. 11'!J28","v":0},{"$f":"'SUB. 11'!L28","v":0},{"$f":"'SUB. 11'!N28","v":0},{"$f":"'SUB. 11'!R28","v":0}]
[null,{"$f":"IF(C195=0,\"\",'SUB. 11'!B29)","v":""},{"$f":"'SUB. 11'!P29","v":0},{"$f":"IF(E195=0,\"\",'SUB. 11'!B29)","v":""},{"$f":"'SUB. 11'!H29","v":0},{"$f":"IF(G195=0,\"\",'SUB. 11'!B29)","v":""},{"$f":"'SUB. 11'!J29","v":0},{"$f":"'SUB. 11'!L29","v":0},{"$f":"'SUB. 11'!N29","v":0},{"$f":"'SUB. 11'!R29","v":0}]
[null,{"$f":"IF(C196=0,\"\",'SUB. 11'!B30)","v":""},{"$f":"'SUB. 11'!P30","v":0},{"$f":"IF(E196=0,\"\",'SUB. 11'!B30)","v":""},{"$f":"'SUB. 11'!H30","v":0},{"$f":"IF(G196=0,\"\",'SUB. 11'!B30)","v":""},{"$f":"'SUB. 11'!J30","v":0},{"$f":"'SUB. 11'!L30","v":0},{"$f":"'SUB. 11'!N30","v":0},{"$f":"'SUB. 11'!R30","v":0}]
[null,{"$f":"IF(C197=0,\"\",'SUB. 11'!B31)","v":""},{"$f":"'SUB. 11'!P31","v":0},{"$f":"IF(E197=0,\"\",'SUB. 11'!B31)","v":""},{"$f":"'SUB. 11'!H31","v":0},{"$f":"IF(G197=0,\"\",'SUB. 11'!B31)","v":""},{"$f":"'SUB. 11'!J31","v":0},{"$f":"'SUB. 11'!L31","v":0},{"$f":"'SUB. 11'!N31","v":0},{"$f":"'SUB. 11'!R31","v":0}]
[null,{"$f":"IF(C198=0,\"\",'SUB. 11'!B32)","v":""},{"$f":"'SUB. 11'!P32","v":0},{"$f":"IF(E198=0,\"\",'SUB. 11'!B32)","v":""},{"$f":"'SUB. 11'!H32","v":0},{"$f":"IF(G198=0,\"\",'SUB. 11'!B32)","v":""},{"$f":"'SUB. 11'!J32","v":0},{"$f":"'SUB. 11'!L32","v":0},{"$f":"'SUB. 11'!N32","v":0},{"$f":"'SUB. 11'!R32","v":0}]
[null,{"$f":"IF(C199=0,\"\",'SUB. 11'!B33)","v":""},{"$f":"'SUB. 11'!P33","v":0},{"$f":"IF(E199=0,\"\",'SUB. 11'!B33)","v":""},{"$f":"'SUB. 11'!H33","v":0},{"$f":"IF(G199=0,\"\",'SUB. 11'!B33)","v":""},{"$f":"'SUB. 11'!J33","v":0},{"$f":"'SUB. 11'!L33","v":0},{"$f":"'SUB. 11'!N33","v":0},{"$f":"'SUB. 11'!R33","v":0}]
[null,{"$f":"IF(C200=0,\"\",'SUB. 11'!B34)","v":""},{"$f":"'SUB. 11'!P34","v":0},{"$f":"IF(E200=0,\"\",'SUB. 11'!B34)","v":""},{"$f":"'SUB. 11'!H34","v":0},{"$f":"IF(G200=0,\"\",'SUB. 11'!B34)","v":""},{"$f":"'SUB. 11'!J34","v":0},{"$f":"'SUB. 11'!L34","v":0},{"$f":"'SUB. 11'!N34","v":0},{"$f":"'SUB. 11'!R34","v":0}]
[null,{"$f":"IF(C201=0,\"\",'SUB. 11'!B35)","v":""},{"$f":"'SUB. 11'!P35","v":0},{"$f":"IF(E201=0,\"\",'SUB. 11'!B35)","v":""},{"$f":"'SUB. 11'!H35","v":0},{"$f":"IF(G201=0,\"\",'SUB. 11'!B35)","v":""},{"$f":"'SUB. 11'!J35","v":0},{"$f":"'SUB. 11'!L35","v":0},{"$f":"'SUB. 11'!N35","v":0},{"$f":"'SUB. 11'!R35","v":0}]
[null,{"$f":"IF(C202=0,\"\",'SUB. 11'!B36)","v":""},{"$f":"'SUB. 11'!P36","v":0},{"$f":"IF(E202=0,\"\",'SUB. 11'!B36)","v":""},{"$f":"'SUB. 11'!H36","v":0},{"$f":"IF(G202=0,\"\",'SUB. 11'!B36)","v":""},{"$f":"'SUB. 11'!J36","v":0},{"$f":"'SUB. 11'!L36","v":0},{"$f":"'SUB. 11'!N36","v":0},{"$f":"'SUB. 11'!R36","v":0}]
["SUBSISTEMA 12",{"$f":"IF(C203=0,\"\",'SUB. 12'!B19)","v":""},{"$f":"'SUB. 12'!P19","v":0},{"$f":"IF(E203=0,\"\",'SUB. 12'!B19)","v":""},{"$f":"'SUB. 12'!H19","v":0},{"$f":"IF(G203=0,\"\",'SUB. 12'!B19)","v":""},{"$f":"'SUB. 12'!J19","v":0},{"$f":"'SUB. 12'!L19","v":0},{"$f":"'SUB. 12'!N19","v":0},{"$f":"'SUB. 12'!R19","v":0}]
[null,{"$f":"IF(C204=0,\"\",'SUB. 12'!B20)","v":""},{"$f":"'SUB. 12'!P20","v":0},{"$f":"IF(E204=0,\"\",'SUB. 12'!B20)","v":""},{"$f":"'SUB. 12'!H20","v":0},{"$f":"IF(G204=0,\"\",'SUB. 12'!B20)","v":""},{"$f":"'SUB. 12'!J20","v":0},{"$f":"'SUB. 12'!L20","v":0},{"$f":"'SUB. 12'!N20","v":0},{"$f":"'SUB. 12'!R20","v":0}]
[null,{"$f":"IF(C205=0,\"\",'SUB. 12'!B21)","v":""},{"$f":"'SUB. 12'!P21","v":0},{"$f":"IF(E205=0,\"\",'SUB. 12'!B21)","v":""},{"$f":"'SUB. 12'!H21","v":0},{"$f":"IF(G205=0,\"\",'SUB. 12'!B21)","v":""},{"$f":"'SUB. 12'!J21","v":0},{"$f":"'SUB. 12'!L21","v":0},{"$f":"'SUB. 12'!N21","v":0},{"$f":"'SUB. 12'!R21","v":0}]
[null,{"$f":"IF(C206=0,\"\",'SUB. 12'!B22)","v":""},{"$f":"'SUB. 12'!P22","v":0},{"$f":"IF(E206=0,\"\",'SUB. 12'!B22)","v":""},{"$f":"'SUB. 12'!H22","v":0},{"$f":"IF(G206=0,\"\",'SUB. 12'!B22)","v":""},{"$f":"'SUB. 12'!J22","v":0},{"$f":"'SUB. 12'!L22","v":0},{"$f":"'SUB. 12'!N22","v":0},{"$f":"'SUB. 12'!R22","v":0}]
[null,{"$f":"IF(C207=0,\"\",'SUB. 12'!B23)","v":""},{"$f":"'SUB. 12'!P23","v":0},{"$f":"IF(E207=0,\"\",'SUB. 12'!B23)","v":""},{"$f":"'SUB. 12'!H23","v":0},{"$f":"IF(G207=0,\"\",'SUB. 12'!B23)","v":""},{"$f":"'SUB. 12'!J23","v":0},{"$f":"'SUB. 12'!L23","v":0},{"$f":"'SUB. 12'!N23","v":0},{"$f":"'SUB. 12'!R23","v":0}]
[null,{"$f":"IF(C208=0,\"\",'SUB. 12'!B24)","v":""},{"$f":"'SUB. 12'!P24","v":0},{"$f":"IF(E208=0,\"\",'SUB. 12'!B24)","v":""},{"$f":"'SUB. 12'!H24","v":0},{"$f":"IF(G208=0,\"\",'SUB. 12'!B24)","v":""},{"$f":"'SUB. 12'!J24","v":0},{"$f":"'SUB. 12'!L24","v":0},{"$f":"'SUB. 12'!N24","v":0},{"$f":"'SUB. 12'!R24","v":0}]
[null,{"$f":"IF(C209=0,\"\",'SUB. 12'!B25)","v":""},{"$f":"'SUB. 12'!P25","v":0},{"$f":"IF(E209=0,\"\",'SUB. 12'!B25)","v":""},{"$f":"'SUB. 12'!H25","v":0},{"$f":"IF(G209=0,\"\",'SUB. 12'!B25)","v":""},{"$f":"'SUB. 12'!J25","v":0},{"$f":"'SUB. 12'!L25","v":0},{"$f":"'SUB. 12'!N25","v":0},{"$f":"'SUB. 12'!R25","v":0}]
[null,{"$f":"IF(C210=0,\"\",'SUB. 12'!B26)","v":""},{"$f":"'SUB. 12'!P26","v":0},{"$f":"IF(E210=0,\"\",'SUB. 12'!B26)","v":""},{"$f":"'SUB. 12'!H26","v":0},{"$f":"IF(G210=0,\"\",'SUB. 12'!B26)","v":""},{"$f":"'SUB. 12'!J26","v":0},{"$f":"'SUB. 12'!L26","v":0},{"$f":"'SUB. 12'!N26","v":0},{"$f":"'SUB. 12'!R26","v":0}]
[null,{"$f":"IF(C211=0,\"\",'SUB. 12'!B27)","v":""},{"$f":"'SUB. 12'!P27","v":0},{"$f":"IF(E211=0,\"\",'SUB. 12'!B27)","v":""},{"$f":"'SUB. 12'!H27","v":0},{"$f":"IF(G211=0,\"\",'SUB. 12'!B27)","v":""},{"$f":"'SUB. 12'!J27","v":0},{"$f":"'SUB. 12'!L27","v":0},{"$f":"'SUB. 12'!N27","v":0},{"$f":"'SUB. 12'!R27","v":0}]
[null,{"$f":"IF(C212=0,\"\",'SUB. 12'!B28)","v":""},{"$f":"'SUB. 12'!P28","v":0},{"$f":"IF(E212=0,\"\",'SUB. 12'!B28)","v":""},{"$f":"'SUB. 12'!H28","v":0},{"$f":"IF(G212=0,\"\",'SUB. 12'!B28)","v":""},{"$f":"'SUB. 12'!J28","v":0},{"$f":"'SUB. 12'!L28","v":0},{"$f":"'SUB. 12'!N28","v":0},{"$f":"'SUB. 12'!R28","v":0}]
[null,{"$f":"IF(C213=0,\"\",'SUB. 12'!B29)","v":""},{"$f":"'SUB. 12'!P29","v":0},{"$f":"IF(E213=0,\"\",'SUB. 12'!B29)","v":""},{"$f":"'SUB. 12'!H29","v":0},{"$f":"IF(G213=0,\"\",'SUB. 12'!B29)","v":""},{"$f":"'SUB. 12'!J29","v":0},{"$f":"'SUB. 12'!L29","v":0},{"$f":"'SUB. 12'!N29","v":0},{"$f":"'SUB. 12'!R29","v":0}]
[null,{"$f":"IF(C214=0,\"\",'SUB. 12'!B30)","v":""},{"$f":"'SUB. 12'!P30","v":0},{"$f":"IF(E214=0,\"\",'SUB. 12'!B30)","v":""},{"$f":"'SUB. 12'!H30","v":0},{"$f":"IF(G214=0,\"\",'SUB. 12'!B30)","v":""},{"$f":"'SUB. 12'!J30","v":0},{"$f":"'SUB. 12'!L30","v":0},{"$f":"'SUB. 12'!N30","v":0},{"$f":"'SUB. 12'!R30","v":0}]
[null,{"$f":"IF(C215=0,\"\",'SUB. 12'!B31)","v":""},{"$f":"'SUB. 12'!P31","v":0},{"$f":"IF(E215=0,\"\",'SUB. 12'!B31)","v":""},{"$f":"'SUB. 12'!H31","v":0},{"$f":"IF(G215=0,\"\",'SUB. 12'!B31)","v":""},{"$f":"'SUB. 12'!J31","v":0},{"$f":"'SUB. 12'!L31","v":0},{"$f":"'SUB. 12'!N31","v":0},{"$f":"'SUB. 12'!R31","v":0}]
[null,{"$f":"IF(C216=0,\"\",'SUB. 12'!B32)","v":""},{"$f":"'SUB. 12'!P32","v":0},{"$f":"IF(E216=0,\"\",'SUB. 12'!B32)","v":""},{"$f":"'SUB. 12'!H32","v":0},{"$f":"IF(G216=0,\"\",'SUB. 12'!B32)","v":""},{"$f":"'SUB. 12'!J32","v":0},{"$f":"'SUB. 12'!L32","v":0},{"$f":"'SUB. 12'!N32","v":0},{"$f":"'SUB. 12'!R32","v":0}]
[null,{"$f":"IF(C217=0,\"\",'SUB. 12'!B33)","v":""},{"$f":"'SUB. 12'!P33","v":0},{"$f":"IF(E217=0,\"\",'SUB. 12'!B33)","v":""},{"$f":"'SUB. 12'!H33","v":0},{"$f":"IF(G217=0,\"\",'SUB. 12'!B33)","v":""},{"$f":"'SUB. 12'!J33","v":0},{"$f":"'SUB. 12'!L33","v":0},{"$f":"'SUB. 12'!N33","v":0},{"$f":"'SUB. 12'!R33","v":0}]
[null,{"$f":"IF(C218=0,\"\",'SUB. 12'!B34)","v":""},{"$f":"'SUB. 12'!P34","v":0},{"$f":"IF(E218=0,\"\",'SUB. 12'!B34)","v":""},{"$f":"'SUB. 12'!H34","v":0},{"$f":"IF(G218=0,\"\",'SUB. 12'!B34)","v":""},{"$f":"'SUB. 12'!J34","v":0},{"$f":"'SUB. 12'!L34","v":0},{"$f":"'SUB. 12'!N34","v":0},{"$f":"'SUB. 12'!R34","v":0}]
[null,{"$f":"IF(C219=0,\"\",'SUB. 12'!B35)","v":""},{"$f":"'SUB. 12'!P35","v":0},{"$f":"IF(E219=0,\"\",'SUB. 12'!B35)","v":""},{"$f":"'SUB. 12'!H35","v":0},{"$f":"IF(G219=0,\"\",'SUB. 12'!B35)","v":""},{"$f":"'SUB. 12'!J35","v":0},{"$f":"'SUB. 12'!L35","v":0},{"$f":"'SUB. 12'!N35","v":0},{"$f":"'SUB. 12'!R35","v":0}]
[null,{"$f":"IF(C220=0,\"\",'SUB. 12'!B36)","v":""},{"$f":"'SUB. 12'!P36","v":0},{"$f":"IF(E220=0,\"\",'SUB. 12'!B36)","v":""},{"$f":"'SUB. 12'!H36","v":0},{"$f":"IF(G220=0,\"\",'SUB. 12'!B36)","v":""},{"$f":"'SUB. 12'!J36","v":0},{"$f":"'SUB. 12'!L36","v":0},{"$f":"'SUB. 12'!N36","v":0},{"$f":"'SUB. 12'!R36","v":0}]
["SUBSISTEMA 13",{"$f":"IF(C221=0,\"\",'SUB. Extrativista'!B19)","v":""},{"$f":"'SUB. Extrativista'!P19","v":0},{"$f":"IF(E221=0,\"\",'SUB. Extrativista'!B19)","v":""},{"$f":"'SUB. Extrativista'!H19","v":0},{"$f":"IF(G221=0,\"\",'SUB. Extrativista'!B19)","v":""},{"$f":"'SUB. Extrativista'!J19","v":0},{"$f":"'SUB. Extrativista'!L19","v":0},{"$f":"'SUB. Extrativista'!N19","v":0},{"$f":"'SUB. Extrativista'!R19","v":0}]
[null,{"$f":"IF(C222=0,\"\",'SUB. Extrativista'!B20)","v":""},{"$f":"'SUB. Extrativista'!P20","v":0},{"$f":"IF(E222=0,\"\",'SUB. Extrativista'!B20)","v":""},{"$f":"'SUB. Extrativista'!H20","v":0},{"$f":"IF(G222=0,\"\",'SUB. Extrativista'!B20)","v":""},{"$f":"'SUB. Extrativista'!J20","v":0},{"$f":"'SUB. Extrativista'!L20","v":0},{"$f":"'SUB. Extrativista'!N20","v":0},{"$f":"'SUB. Extrativista'!R20","v":0}]
[null,{"$f":"IF(C223=0,\"\",'SUB. Extrativista'!B21)","v":""},{"$f":"'SUB. Extrativista'!P21","v":0},{"$f":"IF(E223=0,\"\",'SUB. Extrativista'!B21)","v":""},{"$f":"'SUB. Extrativista'!H21","v":0},{"$f":"IF(G223=0,\"\",'SUB. Extrativista'!B21)","v":""},{"$f":"'SUB. Extrativista'!J21","v":0},{"$f":"'SUB. Extrativista'!L21","v":0},{"$f":"'SUB. Extrativista'!N21","v":0},{"$f":"'SUB. Extrativista'!R21","v":0}]
[null,{"$f":"IF(C224=0,\"\",'SUB. Extrativista'!B22)","v":""},{"$f":"'SUB. Extrativista'!P22","v":0},{"$f":"IF(E224=0,\"\",'SUB. Extrativista'!B22)","v":""},{"$f":"'SUB. Extrativista'!H22","v":0},{"$f":"IF(G224=0,\"\",'SUB. Extrativista'!B22)","v":""},{"$f":"'SUB. Extrativista'!J22","v":0},{"$f":"'SUB. Extrativista'!L22","v":0},{"$f":"'SUB. Extrativista'!N22","v":0},{"$f":"'SUB. Extrativista'!R22","v":0}]
[null,{"$f":"IF(C225=0,\"\",'SUB. Extrativista'!B23)","v":""},{"$f":"'SUB. Extrativista'!P23","v":0},{"$f":"IF(E225=0,\"\",'SUB. Extrativista'!B23)","v":""},{"$f":"'SUB. Extrativista'!H23","v":0},{"$f":"IF(G225=0,\"\",'SUB. Extrativista'!B23)","v":""},{"$f":"'SUB. Extrativista'!J23","v":0},{"$f":"'SUB. Extrativista'!L23","v":0},{"$f":"'SUB. Extrativista'!N23","v":0},{"$f":"'SUB. Extrativista'!R23","v":0}]
[null,{"$f":"IF(C226=0,\"\",'SUB. Extrativista'!B24)","v":""},{"$f":"'SUB. Extrativista'!P24","v":0},{"$f":"IF(E226=0,\"\",'SUB. Extrativista'!B24)","v":""},{"$f":"'SUB. Extrativista'!H24","v":0},{"$f":"IF(G226=0,\"\",'SUB. Extrativista'!B24)","v":""},{"$f":"'SUB. Extrativista'!J24","v":0},{"$f":"'SUB. Extrativista'!L24","v":0},{"$f":"'SUB. Extrativista'!N24","v":0},{"$f":"'SUB. Extrativista'!R24","v":0}]
[null,{"$f":"IF(C227=0,\"\",'SUB. Extrativista'!B25)","v":""},{"$f":"'SUB. Extrativista'!P25","v":0},{"$f":"IF(E227=0,\"\",'SUB. Extrativista'!B25)","v":""},{"$f":"'SUB. Extrativista'!H25","v":0},{"$f":"IF(G227=0,\"\",'SUB. Extrativista'!B25)","v":""},{"$f":"'SUB. Extrativista'!J25","v":0},{"$f":"'SUB. Extrativista'!L25","v":0},{"$f":"'SUB. Extrativista'!N25","v":0},{"$f":"'SUB. Extrativista'!R25","v":0}]
[null,{"$f":"IF(C228=0,\"\",'SUB. Extrativista'!B26)","v":""},{"$f":"'SUB. Extrativista'!P26","v":0},{"$f":"IF(E228=0,\"\",'SUB. Extrativista'!B26)","v":""},{"$f":"'SUB. Extrativista'!H26","v":0},{"$f":"IF(G228=0,\"\",'SUB. Extrativista'!B26)","v":""},{"$f":"'SUB. Extrativista'!J26","v":0},{"$f":"'SUB. Extrativista'!L26","v":0},{"$f":"'SUB. Extrativista'!N26","v":0},{"$f":"'SUB. Extrativista'!R26","v":0}]
[null,{"$f":"IF(C229=0,\"\",'SUB. Extrativista'!B27)","v":""},{"$f":"'SUB. Extrativista'!P27","v":0},{"$f":"IF(E229=0,\"\",'SUB. Extrativista'!B27)","v":""},{"$f":"'SUB. Extrativista'!H27","v":0},{"$f":"IF(G229=0,\"\",'SUB. Extrativista'!B27)","v":""},{"$f":"'SUB. Extrativista'!J27","v":0},{"$f":"'SUB. Extrativista'!L27","v":0},{"$f":"'SUB. Extrativista'!N27","v":0},{"$f":"'SUB. Extrativista'!R27","v":0}]
[null,{"$f":"IF(C230=0,\"\",'SUB. Extrativista'!B28)","v":""},{"$f":"'SUB. Extrativista'!P28","v":0},{"$f":"IF(E230=0,\"\",'SUB. Extrativista'!B28)","v":""},{"$f":"'SUB. Extrativista'!H28","v":0},{"$f":"IF(G230=0,\"\",'SUB. Extrativista'!B28)","v":""},{"$f":"'SUB. Extrativista'!J28","v":0},{"$f":"'SUB. Extrativista'!L28","v":0},{"$f":"'SUB. Extrativista'!N28","v":0},{"$f":"'SUB. Extrativista'!R28","v":0}]
[null,{"$f":"IF(C231=0,\"\",'SUB. Extrativista'!B29)","v":""},{"$f":"'SUB. Extrativista'!P29","v":0},{"$f":"IF(E231=0,\"\",'SUB. Extrativista'!B29)","v":""},{"$f":"'SUB. Extrativista'!H29","v":0},{"$f":"IF(G231=0,\"\",'SUB. Extrativista'!B29)","v":""},{"$f":"'SUB. Extrativista'!J29","v":0},{"$f":"'SUB. Extrativista'!L29","v":0},{"$f":"'SUB. Extrativista'!N29","v":0},{"$f":"'SUB. Extrativista'!R29","v":0}]
[null,{"$f":"IF(C232=0,\"\",'SUB. Extrativista'!B30)","v":""},{"$f":"'SUB. Extrativista'!P30","v":0},{"$f":"IF(E232=0,\"\",'SUB. Extrativista'!B30)","v":""},{"$f":"'SUB. Extrativista'!H30","v":0},{"$f":"IF(G232=0,\"\",'SUB. Extrativista'!B30)","v":""},{"$f":"'SUB. Extrativista'!J30","v":0},{"$f":"'SUB. Extrativista'!L30","v":0},{"$f":"'SUB. Extrativista'!N30","v":0},{"$f":"'SUB. Extrativista'!R30","v":0}]
[null,{"$f":"IF(C233=0,\"\",'SUB. Extrativista'!B31)","v":""},{"$f":"'SUB. Extrativista'!P31","v":0},{"$f":"IF(E233=0,\"\",'SUB. Extrativista'!B31)","v":""},{"$f":"'SUB. Extrativista'!H31","v":0},{"$f":"IF(G233=0,\"\",'SUB. Extrativista'!B31)","v":""},{"$f":"'SUB. Extrativista'!J31","v":0},{"$f":"'SUB. Extrativista'!L31","v":0},{"$f":"'SUB. Extrativista'!N31","v":0},{"$f":"'SUB. Extrativista'!R31","v":0}]
[null,{"$f":"IF(C234=0,\"\",'SUB. Extrativista'!B32)","v":""},{"$f":"'SUB. Extrativista'!P32","v":0},{"$f":"IF(E234=0,\"\",'SUB. Extrativista'!B32)","v":""},{"$f":"'SUB. Extrativista'!H32","v":0},{"$f":"IF(G234=0,\"\",'SUB. Extrativista'!B32)","v":""},{"$f":"'SUB. Extrativista'!J32","v":0},{"$f":"'SUB. Extrativista'!L32","v":0},{"$f":"'SUB. Extrativista'!N32","v":0},{"$f":"'SUB. Extrativista'!R32","v":0}]
[null,{"$f":"IF(C235=0,\"\",'SUB. Extrativista'!B33)","v":""},{"$f":"'SUB. Extrativista'!P33","v":0},{"$f":"IF(E235=0,\"\",'SUB. Extrativista'!B33)","v":""},{"$f":"'SUB. Extrativista'!H33","v":0},{"$f":"IF(G235=0,\"\",'SUB. Extrativista'!B33)","v":""},{"$f":"'SUB. Extrativista'!J33","v":0},{"$f":"'SUB. Extrativista'!L33","v":0},{"$f":"'SUB. Extrativista'!N33","v":0},{"$f":"'SUB. Extrativista'!R33","v":0}]
[null,{"$f":"IF(C236=0,\"\",'SUB. Extrativista'!B34)","v":""},{"$f":"'SUB. Extrativista'!P34","v":0},{"$f":"IF(E236=0,\"\",'SUB. Extrativista'!B34)","v":""},{"$f":"'SUB. Extrativista'!H34","v":0},{"$f":"IF(G236=0,\"\",'SUB. Extrativista'!B34)","v":""},{"$f":"'SUB. Extrativista'!J34","v":0},{"$f":"'SUB. Extrativista'!L34","v":0},{"$f":"'SUB. Extrativista'!N34","v":0},{"$f":"'SUB. Extrativista'!R34","v":0}]
[null,{"$f":"IF(C237=0,\"\",'SUB. Extrativista'!B35)","v":""},{"$f":"'SUB. Extrativista'!P35","v":0},{"$f":"IF(E237=0,\"\",'SUB. Extrativista'!B35)","v":""},{"$f":"'SUB. Extrativista'!H35","v":0},{"$f":"IF(G237=0,\"\",'SUB. Extrativista'!B35)","v":""},{"$f":"'SUB. Extrativista'!J35","v":0},{"$f":"'SUB. Extrativista'!L35","v":0},{"$f":"'SUB. Extrativista'!N35","v":0},{"$f":"'SUB. Extrativista'!R35","v":0}]
[null,{"$f":"IF(C238=0,\"\",'SUB. Extrativista'!B36)","v":0},{"$f":"'SUB. Extrativista'!P36","v":1E-4},{"$f":"IF(E238=0,\"\",'SUB. Extrativista'!B36)","v":0},{"$f":"'SUB. Extrativista'!H36","v":1E-4},{"$f":"IF(G238=0,\"\",'SUB. Extrativista'!B36)","v":""},{"$f":"'SUB. Extrativista'!J36","v":0},{"$f":"'SUB. Extrativista'!L36","v":0},{"$f":"'SUB. Extrativista'!N36","v":0},{"$f":"'SUB. Extrativista'!R36","v":0}]

{"sheet":"TD Produções","index":30,"n_rows":27,"n_cols":8,"rows_kept":27,"cut":false,"hidden":true,"merged":[]}
[]
[]
[null,null,null,"Dados"]
["Produtos 1","Produtos 2","Produtos 3","Soma de Produções","Soma de Venda","Soma de Autoconsumo","Soma de Doações trocas","Soma de Estoque"]
["","",null,0,0,0,0,0]
[null,null,"cebolinha",0,0,144,108,0]
["Leite","Leite","Leite",8558,8236.8000000000011,211.20000000000002,110.00000000000001,0]
["vaca (4)","vaca (4)",null,9692.3076923076933,2000.0000000000002,0,0,7692.3076923076933]
["porco","porco","porco",14730,7830,150,150,6600]
["animal","animal",null,405,180,0,0,225]
["Galinhas ","Galinhas ","Galinhas ",2580,180,1440,360,600]
["Pato","","Pato",400,0,300,0,100]
["Peru","",null,60,0,0,0,60]
["ovo","ovo","ovo",292.91666666666669,30,240,16.666666666666668,6.25]
["jenipapo","","jenipapo",45,0,45,0,0]
["cidreira","","cidreira",96,0,96,0,0]
["açerola","","açerola",96,0,96,0,0]
["pinha","","pinha",60,0,60,0,0]
["coco verde","","coco verde",140,0,140,0,0]
["laranja","","laranja",12,0,12,0,0]
["hortelã de sete dor","","hortelã de sete dor",96,0,96,0,0]
["hortelã","","hortelã",96,0,96,0,0]
["samba caitá","","samba caitá",96,0,96,0,0]
["couve","","couve",336,0,192,144,0]
["pimentão ","","pimentão ",4,0,4,0,0]
["coentro","","coentro",336,0,192,144,0]
["Millho seco","Millho seco","Millho seco",270,200,50,20,0]

{"sheet":"TDG Conj, Produções","index":31,"n_rows":10,"n_cols":23,"rows_kept":10,"cut":false,"hidden":true,"merged":[]}
["Produtos 2","(Vários itens)"]
["Produtos 3","(Tudo)"]
[]
[null,"Produtos 1"]
["Dados",null,"Leite","vaca (4)","porco","animal","Galinhas ","Pato","Peru","ovo","jenipapo","cidreira","açerola","pinha","coco verde","laranja","hortelã de sete dor","hortelã","samba caitá","couve","pimentão ","coentro","Millho seco"]
["Produções.",0,8558,9692.3076923076933,14730,405,2580,400,60,292.91666666666669,45,96,96,60,140,12,96,96,96,336,4,336,270]
["Vendas.",0,8236.8000000000011,2000.0000000000002,7830,180,180,0,0,30,0,0,0,0,0,0,0,0,0,0,0,0,200]
["Autoconsumo.",144,211.20000000000002,0,150,0,1440,300,0,240,45,96,96,60,140,12,96,96,96,192,4,192,50]
["Doações trocas.",108,110.00000000000001,0,150,0,360,0,0,16.666666666666668,0,0,0,0,0,0,0,0,0,144,0,144,20]
["Estoque.",0,0,7692.3076923076933,6600,225,600,100,60,6.25,0,0,0,0,0,0,0,0,0,0,0,0,0]

{"sheet":"TDG produções","index":32,"n_rows":27,"n_cols":2,"rows_kept":27,"cut":false,"hidden":true,"merged":[]}
[]
[]
["Soma de Produções"]
["Produtos 1","Total"]
[0,1E-4]
["Leite",8558]
["vaca (4)",9692.3076923076933]
["porco",14730]
["animal",405]
["Galinhas ",2580]
["Pato",400]
["Peru",60]
["ovo",292.91666666666669]
["jenipapo",45]
["cidreira",96]
["açerola",96]
["pinha",60]
["coco verde",140]
["laranja",12]
["hortelã de sete dor",96]
["hortelã",96]
["samba caitá",96]
["couve",336]
["pimentão ",4]
["coentro",336]
["Millho seco",270]
["Total Geral",38401.224458974357]

{"sheet":"TDG Venda","index":33,"n_rows":13,"n_cols":2,"rows_kept":13,"cut":false,"hidden":true,"merged":[]}
[]
[]
["Soma de Venda"]
["Produtos 2","Total"]
[0,1E-4]
["Leite",8236.8000000000011]
["vaca (4)",2000.0000000000002]
["porco",7830]
["animal",180]
["ovo",30]
["Galinhas ",180]
["Millho seco",200]
["Total Geral",18656.8001]

{"sheet":"TDG Autocons.","index":34,"n_rows":24,"n_cols":2,"rows_kept":24,"cut":false,"hidden":true,"merged":[]}
[]
[]
["Soma de Autoconsumo"]
["Produtos 3","Total"]
["Leite",211.20000000000002]
["Galinhas ",1440]
["Pato",300]
["ovo",240]
["jenipapo",45]
["cidreira",96]
["açerola",96]
["pinha",60]
["coco verde",140]
["laranja",12]
["hortelã de sete dor",96]
["hortelã",96]
["samba caitá",96]
["couve",192]
["pimentão ",4]
["coentro",192]
["cebolinha",144]
["porco",150]
["Millho seco",50]
["Total Geral",3660.2]

{"sheet":"Tabela Insumos","index":35,"n_rows":457,"n_cols":12,"rows_kept":457,"cut":false,"hidden":true,"merged":[[237,0,251,0],[297,0,311,0],[75,0,92,0],[93,0,110,0],[111,0,128,0],[1,10,1,11],[1,4,1,5],[1,6,1,7],[1,8,1,9],[3,0,20,0],[39,0,56,0],[21,0,38,0],[57,0,74,0],[129,0,146,0],[147,0,164,0],[432,0,456,0],[165,0,182,0],[183,0,200,0],[201,0,218,0],[219,0,236,0],[267,0,281,0],[312,0,326,0],[417,0,431,0],[327,0,341,0],[342,0,356,0],[357,0,371,0],[372,0,386,0],[402,0,416,0],[252,0,266,0],[387,0,401,0],[282,0,296,0]]}
[]
[null,null,null,null,"Produzidos",null,"Consumidos",null,"Estoque período anterior",null,"Estoque Final do período"]
[null,"Produtos","Unidade","Valor Unitário","Quantidade","Produzido","Quantidade","Consumidos","Quantidade","Estoque período anterior","Quantidade","Estoque final período"]
["SUBSISTEMA 1",{"$f":"IF(F4=0,\"\",'SUB. 1'!B19)","v":""},{"$f":"IF(F4=0,\"\",'SUB. 1'!E19)","v":""},{"$f":"IF(F4=0,\"\",'SUB. 1'!F19)","v":""},{"$f":"'SUB. 1'!Q19","v":0},{"$f":"'SUB. 1'!R19","v":0},null,{"$f":"N4","v":0},{"$f":"N4","v":0},{"$f":"N4","v":0},{"$f":"N4","v":0},{"$f":"N4","v":0}]
[null,{"$f":"IF(F5=0,\"\",'SUB. 1'!B20)","v":""},{"$f":"IF(F5=0,\"\",'SUB. 1'!E20)","v":""},{"$f":"IF(F5=0,\"\",'SUB. 1'!F20)","v":""},{"$f":"'SUB. 1'!Q20","v":0},{"$f":"'SUB. 1'!R20","v":0},null,{"$f":"N5","v":0},{"$f":"N5","v":0},{"$f":"N5","v":0},{"$f":"N5","v":0},{"$f":"N5","v":0}]
[null,{"$f":"IF(F6=0,\"\",'SUB. 1'!B21)","v":"esterco"},{"$f":"IF(F6=0,\"\",'SUB. 1'!E21)","v":"kg"},{"$f":"IF(F6=0,\"\",'SUB. 1'!F21)","v":2},{"$f":"'SUB. 1'!Q21","v":1680},{"$f":"'SUB. 1'!R21","v":3360},null,0,0,0,0,{"$f":"N6","v":0}]
[null,{"$f":"IF(F7=0,\"\",'SUB. 1'!B22)","v":""},{"$f":"IF(F7=0,\"\",'SUB. 1'!E22)","v":""},{"$f":"IF(F7=0,\"\",'SUB. 1'!F22)","v":""},{"$f":"'SUB. 1'!Q22","v":0},{"$f":"'SUB. 1'!R22","v":0},null,0,0,0,0,{"$f":"N7","v":0}]
[null,{"$f":"IF(F8=0,\"\",'SUB. 1'!B23)","v":""},{"$f":"IF(F8=0,\"\",'SUB. 1'!E23)","v":""},{"$f":"IF(F8=0,\"\",'SUB. 1'!F23)","v":""},{"$f":"'SUB. 1'!Q23","v":0},{"$f":"'SUB. 1'!R23","v":0},null,0,0,0,0,0]
[null,{"$f":"IF(F9=0,\"\",'SUB. 1'!B24)","v":""},{"$f":"IF(F9=0,\"\",'SUB. 1'!E24)","v":""},{"$f":"IF(F9=0,\"\",'SUB. 1'!F24)","v":""},{"$f":"'SUB. 1'!Q24","v":0},{"$f":"'SUB. 1'!R24","v":0},null,0,0,0,0,0]
[null,{"$f":"IF(F10=0,\"\",'SUB. 1'!B25)","v":""},{"$f":"IF(F10=0,\"\",'SUB. 1'!E25)","v":""},{"$f":"IF(F10=0,\"\",'SUB. 1'!F25)","v":""},{"$f":"'SUB. 1'!Q25","v":0},{"$f":"'SUB. 1'!R25","v":0},null,0,0,0,0,0]
[null,{"$f":"IF(F11=0,\"\",'SUB. 1'!B26)","v":""},{"$f":"IF(F11=0,\"\",'SUB. 1'!E26)","v":""},{"$f":"IF(F11=0,\"\",'SUB. 1'!F26)","v":""},{"$f":"'SUB. 1'!Q26","v":0},{"$f":"'SUB. 1'!R26","v":0},null,0,0,0,0,0]
[null,{"$f":"IF(F12=0,\"\",'SUB. 1'!B27)","v":""},{"$f":"IF(F12=0,\"\",'SUB. 1'!E27)","v":""},{"$f":"IF(F12=0,\"\",'SUB. 1'!F27)","v":""},{"$f":"'SUB. 1'!Q27","v":0},{"$f":"'SUB. 1'!R27","v":0},null,0,0,0,0,0]
[null,{"$f":"IF(F13=0,\"\",'SUB. 1'!B28)","v":""},{"$f":"IF(F13=0,\"\",'SUB. 1'!E28)","v":""},{"$f":"IF(F13=0,\"\",'SUB. 1'!F28)","v":""},{"$f":"'SUB. 1'!Q28","v":0},{"$f":"'SUB. 1'!R28","v":0},null,0,0,0,0,0]
[null,{"$f":"IF(F14=0,\"\",'SUB. 1'!B29)","v":""},{"$f":"IF(F14=0,\"\",'SUB. 1'!E29)","v":""},{"$f":"IF(F14=0,\"\",'SUB. 1'!F29)","v":""},{"$f":"'SUB. 1'!Q29","v":0},{"$f":"'SUB. 1'!R29","v":0},null,0,0,0,0,0]
[null,{"$f":"IF(F15=0,\"\",'SUB. 1'!B30)","v":""},{"$f":"IF(F15=0,\"\",'SUB. 1'!E30)","v":""},{"$f":"IF(F15=0,\"\",'SUB. 1'!F30)","v":""},{"$f":"'SUB. 1'!Q30","v":0},{"$f":"'SUB. 1'!R30","v":0},null,0,0,0,0,0]
[null,{"$f":"IF(F16=0,\"\",'SUB. 1'!B31)","v":""},{"$f":"IF(F16=0,\"\",'SUB. 1'!E31)","v":""},{"$f":"IF(F16=0,\"\",'SUB. 1'!F31)","v":""},{"$f":"'SUB. 1'!Q31","v":0},{"$f":"'SUB. 1'!R31","v":0},null,0,0,0,0,0]
[null,{"$f":"IF(F17=0,\"\",'SUB. 1'!B32)","v":""},{"$f":"IF(F17=0,\"\",'SUB. 1'!E32)","v":""},{"$f":"IF(F17=0,\"\",'SUB. 1'!F32)","v":""},{"$f":"'SUB. 1'!Q32","v":0},{"$f":"'SUB. 1'!R32","v":0},null,0,0,0,0,0]
[null,{"$f":"IF(F18=0,\"\",'SUB. 1'!B33)","v":""},{"$f":"IF(F18=0,\"\",'SUB. 1'!E33)","v":""},{"$f":"IF(F18=0,\"\",'SUB. 1'!F33)","v":""},{"$f":"'SUB. 1'!Q33","v":0},{"$f":"'SUB. 1'!R33","v":0},null,0,0,0,0,0]
[null,{"$f":"IF(F19=0,\"\",'SUB. 1'!B34)","v":""},{"$f":"IF(F19=0,\"\",'SUB. 1'!E34)","v":""},{"$f":"IF(F19=0,\"\",'SUB. 1'!F34)","v":""},{"$f":"'SUB. 1'!Q34","v":0},{"$f":"'SUB. 1'!R34","v":0},null,0,0,0,0,0]
[null,{"$f":"IF(F20=0,\"\",'SUB. 1'!B35)","v":""},{"$f":"IF(F20=0,\"\",'SUB. 1'!E35)","v":""},{"$f":"IF(F20=0,\"\",'SUB. 1'!F35)","v":""},{"$f":"'SUB. 1'!Q35","v":0},{"$f":"'SUB. 1'!R35","v":0},null,0,0,0,0,0]
[null,{"$f":"IF(F21=0,\"\",'SUB. 1'!B36)","v":""},{"$f":"IF(F21=0,\"\",'SUB. 1'!E36)","v":""},{"$f":"IF(F21=0,\"\",'SUB. 1'!F36)","v":""},{"$f":"'SUB. 1'!Q36","v":0},{"$f":"'SUB. 1'!R36","v":0},null,0,0,0,0,0]
["SUBSISTEMA 2",{"$f":"IF(F22=0,\"\",'SUB. 2'!B19:D19)","v":""},{"$f":"IF(F22=0,\"\",'SUB. 2'!E19)","v":""},{"$f":"IF(F22=0,\"\",'SUB. 2'!F19)","v":""},{"$f":"'SUB. 2'!Q19","v":0},{"$f":"'SUB. 2'!R19","v":0},null,0,0,0,0,0]
[null,{"$f":"IF(F23=0,\"\",'SUB. 2'!B20:D20)","v":"esterco"},{"$f":"IF(F23=0,\"\",'SUB. 2'!E20)","v":"kg"},{"$f":"IF(F23=0,\"\",'SUB. 2'!F20)","v":0.42},{"$f":"'SUB. 2'!Q20","v":365},{"$f":"'SUB. 2'!R20","v":153.29999999999998},null,0,0,0,0,0]
[null,{"$f":"IF(F24=0,\"\",'SUB. 2'!B21:D21)","v":""},{"$f":"IF(F24=0,\"\",'SUB. 2'!E21)","v":""},{"$f":"IF(F24=0,\"\",'SUB. 2'!F21)","v":""},{"$f":"'SUB. 2'!Q21","v":0},{"$f":"'SUB. 2'!R21","v":0},null,0,0,0,0,0]
[null,{"$f":"IF(F25=0,\"\",'SUB. 2'!B22:D22)","v":""},{"$f":"IF(F25=0,\"\",'SUB. 2'!E22)","v":""},{"$f":"IF(F25=0,\"\",'SUB. 2'!F22)","v":""},{"$f":"'SUB. 2'!Q22","v":0},{"$f":"'SUB. 2'!R22","v":0},null,0,0,0,0,0]
[null,{"$f":"IF(F26=0,\"\",'SUB. 2'!B23:D23)","v":""},{"$f":"IF(F26=0,\"\",'SUB. 2'!E23)","v":""},{"$f":"IF(F26=0,\"\",'SUB. 2'!F23)","v":""},{"$f":"'SUB. 2'!Q23","v":0},{"$f":"'SUB. 2'!R23","v":0},null,0,0,0,0,0]
[null,{"$f":"IF(F27=0,\"\",'SUB. 2'!B24:D24)","v":""},{"$f":"IF(F27=0,\"\",'SUB. 2'!E24)","v":""},{"$f":"IF(F27=0,\"\",'SUB. 2'!F24)","v":""},{"$f":"'SUB. 2'!Q24","v":0},{"$f":"'SUB. 2'!R24","v":0},null,0,0,0,0,0]
[null,{"$f":"IF(F28=0,\"\",'SUB. 2'!B25:D25)","v":""},{"$f":"IF(F28=0,\"\",'SUB. 2'!E25)","v":""},{"$f":"IF(F28=0,\"\",'SUB. 2'!F25)","v":""},{"$f":"'SUB. 2'!Q25","v":0},{"$f":"'SUB. 2'!R25","v":0},null,0,0,0,0,0]
[null,{"$f":"IF(F29=0,\"\",'SUB. 2'!B26:D26)","v":""},{"$f":"IF(F29=0,\"\",'SUB. 2'!E26)","v":""},{"$f":"IF(F29=0,\"\",'SUB. 2'!F26)","v":""},{"$f":"'SUB. 2'!Q26","v":0},{"$f":"'SUB. 2'!R26","v":0},null,0,0,0,0,0]
[null,{"$f":"IF(F30=0,\"\",'SUB. 2'!B27:D27)","v":""},{"$f":"IF(F30=0,\"\",'SUB. 2'!E27)","v":""},{"$f":"IF(F30=0,\"\",'SUB. 2'!F27)","v":""},{"$f":"'SUB. 2'!Q27","v":0},{"$f":"'SUB. 2'!R27","v":0},null,0,0,0,0,0]
[null,{"$f":"IF(F31=0,\"\",'SUB. 2'!B28:D28)","v":""},{"$f":"IF(F31=0,\"\",'SUB. 2'!E28)","v":""},{"$f":"IF(F31=0,\"\",'SUB. 2'!F28)","v":""},{"$f":"'SUB. 2'!Q28","v":0},{"$f":"'SUB. 2'!R28","v":0},null,0,0,0,0,0]
[null,{"$f":"IF(F32=0,\"\",'SUB. 2'!B29:D29)","v":""},{"$f":"IF(F32=0,\"\",'SUB. 2'!E29)","v":""},{"$f":"IF(F32=0,\"\",'SUB. 2'!F29)","v":""},{"$f":"'SUB. 2'!Q29","v":0},{"$f":"'SUB. 2'!R29","v":0},null,0,0,0,0,0]
[null,{"$f":"IF(F33=0,\"\",'SUB. 2'!B30:D30)","v":""},{"$f":"IF(F33=0,\"\",'SUB. 2'!E30)","v":""},{"$f":"IF(F33=0,\"\",'SUB. 2'!F30)","v":""},{"$f":"'SUB. 2'!Q30","v":0},{"$f":"'SUB. 2'!R30","v":0},null,0,0,0,0,0]
[null,{"$f":"IF(F34=0,\"\",'SUB. 2'!B31:D31)","v":""},{"$f":"IF(F34=0,\"\",'SUB. 2'!E31)","v":""},{"$f":"IF(F34=0,\"\",'SUB. 2'!F31)","v":""},{"$f":"'SUB. 2'!Q31","v":0},{"$f":"'SUB. 2'!R31","v":0},null,0,0,0,0,0]
[null,{"$f":"IF(F35=0,\"\",'SUB. 2'!B32:D32)","v":""},{"$f":"IF(F35=0,\"\",'SUB. 2'!E32)","v":""},{"$f":"IF(F35=0,\"\",'SUB. 2'!F32)","v":""},{"$f":"'SUB. 2'!Q32","v":0},{"$f":"'SUB. 2'!R32","v":0},null,0,0,0,0,0]
[null,{"$f":"IF(F36=0,\"\",'SUB. 2'!B33:D33)","v":""},{"$f":"IF(F36=0,\"\",'SUB. 2'!E33)","v":""},{"$f":"IF(F36=0,\"\",'SUB. 2'!F33)","v":""},{"$f":"'SUB. 2'!Q33","v":0},{"$f":"'SUB. 2'!R33","v":0},null,0,0,0,0,0]
[null,{"$f":"IF(F37=0,\"\",'SUB. 2'!B34:D34)","v":""},{"$f":"IF(F37=0,\"\",'SUB. 2'!E34)","v":""},{"$f":"IF(F37=0,\"\",'SUB. 2'!F34)","v":""},{"$f":"'SUB. 2'!Q34","v":0},{"$f":"'SUB. 2'!R34","v":0},null,0,0,0,0,0]
[null,{"$f":"IF(F38=0,\"\",'SUB. 2'!B35:D35)","v":""},{"$f":"IF(F38=0,\"\",'SUB. 2'!E35)","v":""},{"$f":"IF(F38=0,\"\",'SUB. 2'!F35)","v":""},{"$f":"'SUB. 2'!Q35","v":0},{"$f":"'SUB. 2'!R35","v":0},null,0,0,0,0,0]
[null,{"$f":"'SUB. 2'!B36:D36","v":0},{"$f":"IF(F39=0,\"\",'SUB. 2'!E36)","v":""},{"$f":"IF(F39=0,\"\",'SUB. 2'!F36)","v":""},{"$f":"'SUB. 2'!Q36","v":0},{"$f":"'SUB. 2'!R36","v":0},null,0,0,0,0,0]
["SUBSISTEMA 3",{"$f":"IF(F40=0,\"\",'SUB. 3'!B19:D19)","v":""},{"$f":"IF(F40=0,\"\",'SUB. 3'!E19)","v":""},{"$f":"IF(F40=0,\"\",'SUB. 3'!F19)","v":""},{"$f":"'SUB. 3'!Q19","v":0},{"$f":"'SUB. 3'!R19","v":0},null,0,0,0,0,0]
[null,{"$f":"IF(F41=0,\"\",'SUB. 3'!B20:D20)","v":"esterco "},{"$f":"IF(F41=0,\"\",'SUB. 3'!E20)","v":"kg"},{"$f":"IF(F41=0,\"\",'SUB. 3'!F20)","v":0.42},{"$f":"'SUB. 3'!Q20","v":1500},{"$f":"'SUB. 3'!R20","v":630},null,0,0,0,0,0]
[null,{"$f":"IF(F42=0,\"\",'SUB. 3'!B21:D21)","v":""},{"$f":"IF(F42=0,\"\",'SUB. 3'!E21)","v":""},{"$f":"IF(F42=0,\"\",'SUB. 3'!F21)","v":""},{"$f":"'SUB. 3'!Q21","v":0},{"$f":"'SUB. 3'!R21","v":0},null,0,0,0,0,0]
[null,{"$f":"IF(F43=0,\"\",'SUB. 3'!B22:D22)","v":""},{"$f":"IF(F43=0,\"\",'SUB. 3'!E22)","v":""},{"$f":"IF(F43=0,\"\",'SUB. 3'!F22)","v":""},{"$f":"'SUB. 3'!Q22","v":0},{"$f":"'SUB. 3'!R22","v":0},null,0,0,0,0,0]
[null,{"$f":"IF(F44=0,\"\",'SUB. 3'!B23:D23)","v":""},{"$f":"IF(F44=0,\"\",'SUB. 3'!E23)","v":""},{"$f":"IF(F44=0,\"\",'SUB. 3'!F23)","v":""},{"$f":"'SUB. 3'!Q23","v":0},{"$f":"'SUB. 3'!R23","v":0},null,0,0,0,0,0]
[null,{"$f":"IF(F45=0,\"\",'SUB. 3'!B24:D24)","v":""},{"$f":"IF(F45=0,\"\",'SUB. 3'!E24)","v":""},{"$f":"IF(F45=0,\"\",'SUB. 3'!F24)","v":""},{"$f":"'SUB. 3'!Q24","v":0},{"$f":"'SUB. 3'!R24","v":0},null,0,0,0,0,0]
[null,{"$f":"IF(F46=0,\"\",'SUB. 3'!B25:D25)","v":""},{"$f":"IF(F46=0,\"\",'SUB. 3'!E25)","v":""},{"$f":"IF(F46=0,\"\",'SUB. 3'!F25)","v":""},{"$f":"'SUB. 3'!Q25","v":0},{"$f":"'SUB. 3'!R25","v":0},null,0,0,0,0,0]
[null,{"$f":"IF(F47=0,\"\",'SUB. 3'!B26:D26)","v":""},{"$f":"IF(F47=0,\"\",'SUB. 3'!E26)","v":""},{"$f":"IF(F47=0,\"\",'SUB. 3'!F26)","v":""},{"$f":"'SUB. 3'!Q26","v":0},{"$f":"'SUB. 3'!R26","v":0},null,0,0,0,0,0]
[null,{"$f":"IF(F48=0,\"\",'SUB. 3'!B27:D27)","v":""},{"$f":"IF(F48=0,\"\",'SUB. 3'!E27)","v":""},{"$f":"IF(F48=0,\"\",'SUB. 3'!F27)","v":""},{"$f":"'SUB. 3'!Q27","v":0},{"$f":"'SUB. 3'!R27","v":0},null,0,0,0,0,0]
[null,{"$f":"IF(F49=0,\"\",'SUB. 3'!B28:D28)","v":""},{"$f":"IF(F49=0,\"\",'SUB. 3'!E28)","v":""},{"$f":"IF(F49=0,\"\",'SUB. 3'!F28)","v":""},{"$f":"'SUB. 3'!Q28","v":0},{"$f":"'SUB. 3'!R28","v":0},null,0,0,0,0,0]
[null,{"$f":"IF(F50=0,\"\",'SUB. 3'!B29:D29)","v":""},{"$f":"IF(F50=0,\"\",'SUB. 3'!E29)","v":""},{"$f":"IF(F50=0,\"\",'SUB. 3'!F29)","v":""},{"$f":"'SUB. 3'!Q29","v":0},{"$f":"'SUB. 3'!R29","v":0},null,0,0,0,0,0]
[null,{"$f":"IF(F51=0,\"\",'SUB. 3'!B30:D30)","v":""},{"$f":"IF(F51=0,\"\",'SUB. 3'!E30)","v":""},{"$f":"IF(F51=0,\"\",'SUB. 3'!F30)","v":""},{"$f":"'SUB. 3'!Q30","v":0},{"$f":"'SUB. 3'!R30","v":0},null,0,0,0,0,0]
[null,{"$f":"IF(F52=0,\"\",'SUB. 3'!B31:D31)","v":""},{"$f":"IF(F52=0,\"\",'SUB. 3'!E31)","v":""},{"$f":"IF(F52=0,\"\",'SUB. 3'!F31)","v":""},{"$f":"'SUB. 3'!Q31","v":0},{"$f":"'SUB. 3'!R31","v":0},null,0,0,0,0,0]
[null,{"$f":"IF(F53=0,\"\",'SUB. 3'!B32:D32)","v":""},{"$f":"IF(F53=0,\"\",'SUB. 3'!E32)","v":""},{"$f":"IF(F53=0,\"\",'SUB. 3'!F32)","v":""},{"$f":"'SUB. 3'!Q32","v":0},{"$f":"'SUB. 3'!R32","v":0},null,0,0,0,0,0]
[null,{"$f":"IF(F54=0,\"\",'SUB. 3'!B33:D33)","v":""},{"$f":"IF(F54=0,\"\",'SUB. 3'!E33)","v":""},{"$f":"IF(F54=0,\"\",'SUB. 3'!F33)","v":""},{"$f":"'SUB. 3'!Q33","v":0},{"$f":"'SUB. 3'!R33","v":0},null,0,0,0,0,0]
[null,{"$f":"IF(F55=0,\"\",'SUB. 3'!B34:D34)","v":""},{"$f":"IF(F55=0,\"\",'SUB. 3'!E34)","v":""},{"$f":"IF(F55=0,\"\",'SUB. 3'!F34)","v":""},{"$f":"'SUB. 3'!Q34","v":0},{"$f":"'SUB. 3'!R34","v":0},null,0,0,0,0,0]
[null,{"$f":"IF(F56=0,\"\",'SUB. 3'!B35:D35)","v":""},{"$f":"IF(F56=0,\"\",'SUB. 3'!E35)","v":""},{"$f":"IF(F56=0,\"\",'SUB. 3'!F35)","v":""},{"$f":"'SUB. 3'!Q35","v":0},{"$f":"'SUB. 3'!R35","v":0},null,0,0,0,0,0]
[null,{"$f":"IF(F57=0,\"\",'SUB. 3'!B36:D36)","v":""},{"$f":"IF(F57=0,\"\",'SUB. 3'!E36)","v":""},{"$f":"IF(F57=0,\"\",'SUB. 3'!F36)","v":""},{"$f":"'SUB. 3'!Q36","v":0},{"$f":"'SUB. 3'!R36","v":0},null,0,0,0,0,0]
["SUBSISTEMA 4",{"$f":"IF(F58=0,\"\",'SUB. 4'!B19:D19)","v":""},{"$f":"IF(F58=0,\"\",'SUB. 4'!E19)","v":""},{"$f":"IF(F58=0,\"\",'SUB. 4'!F19)","v":""},{"$f":"'SUB. 4'!Q19","v":0},{"$f":"'SUB. 4'!R19","v":0},null,0,0,0,0,0]
[null,{"$f":"IF(F59=0,\"\",'SUB. 4'!B20:D20)","v":""},{"$f":"IF(F59=0,\"\",'SUB. 4'!E20)","v":""},{"$f":"IF(F59=0,\"\",'SUB. 4'!F20)","v":""},{"$f":"'SUB. 4'!Q20","v":0},{"$f":"'SUB. 4'!R20","v":0},null,0,0,0,0,0]
[null,{"$f":"IF(F60=0,\"\",'SUB. 4'!B21:D21)","v":""},{"$f":"IF(F60=0,\"\",'SUB. 4'!E21)","v":""},{"$f":"IF(F60=0,\"\",'SUB. 4'!F21)","v":""},{"$f":"'SUB. 4'!Q21","v":0},{"$f":"'SUB. 4'!R21","v":0},null,0,0,0,0,0]
[null,{"$f":"IF(F61=0,\"\",'SUB. 4'!B22:D22)","v":""},{"$f":"IF(F61=0,\"\",'SUB. 4'!E22)","v":""},{"$f":"IF(F61=0,\"\",'SUB. 4'!F22)","v":""},{"$f":"'SUB. 4'!Q22","v":0},{"$f":"'SUB. 4'!R22","v":0},null,0,0,0,0,0]
[null,{"$f":"IF(F62=0,\"\",'SUB. 4'!B23:D23)","v":"esterco"},{"$f":"IF(F62=0,\"\",'SUB. 4'!E23)","v":"kg"},{"$f":"IF(F62=0,\"\",'SUB. 4'!F23)","v":0.4},{"$f":"'SUB. 4'!Q23","v":180},{"$f":"'SUB. 4'!R23","v":72},null,0,0,0,0,0]
[null,{"$f":"IF(F63=0,\"\",'SUB. 4'!B24:D24)","v":""},{"$f":"IF(F63=0,\"\",'SUB. 4'!E24)","v":""},{"$f":"IF(F63=0,\"\",'SUB. 4'!F24)","v":""},{"$f":"'SUB. 4'!Q24","v":0},{"$f":"'SUB. 4'!R24","v":0},null,0,0,0,0,0]
[null,{"$f":"IF(F64=0,\"\",'SUB. 4'!B25:D25)","v":""},{"$f":"IF(F64=0,\"\",'SUB. 4'!E25)","v":""},{"$f":"IF(F64=0,\"\",'SUB. 4'!F25)","v":""},{"$f":"'SUB. 4'!Q25","v":0},{"$f":"'SUB. 4'!R25","v":0},null,0,0,0,0,0]
[null,{"$f":"IF(F65=0,\"\",'SUB. 4'!B26:D26)","v":""},{"$f":"IF(F65=0,\"\",'SUB. 4'!E26)","v":""},{"$f":"IF(F65=0,\"\",'SUB. 4'!F26)","v":""},{"$f":"'SUB. 4'!Q26","v":0},{"$f":"'SUB. 4'!R26","v":0},null,0,0,0,0,0]
[null,{"$f":"IF(F66=0,\"\",'SUB. 4'!B27:D27)","v":""},{"$f":"IF(F66=0,\"\",'SUB. 4'!E27)","v":""},{"$f":"IF(F66=0,\"\",'SUB. 4'!F27)","v":""},{"$f":"'SUB. 4'!Q27","v":0},{"$f":"'SUB. 4'!R27","v":0},null,0,0,0,0,0]
[null,{"$f":"IF(F67=0,\"\",'SUB. 4'!B28:D28)","v":""},{"$f":"IF(F67=0,\"\",'SUB. 4'!E28)","v":""},{"$f":"IF(F67=0,\"\",'SUB. 4'!F28)","v":""},{"$f":"'SUB. 4'!Q28","v":0},{"$f":"'SUB. 4'!R28","v":0},null,0,0,0,0,0]
[null,{"$f":"IF(F68=0,\"\",'SUB. 4'!B29:D29)","v":""},{"$f":"IF(F68=0,\"\",'SUB. 4'!E29)","v":""},{"$f":"IF(F68=0,\"\",'SUB. 4'!F29)","v":""},{"$f":"'SUB. 4'!Q29","v":0},{"$f":"'SUB. 4'!R29","v":0},null,0,0,0,0,0]
[null,{"$f":"IF(F69=0,\"\",'SUB. 4'!B30:D30)","v":""},{"$f":"IF(F69=0,\"\",'SUB. 4'!E30)","v":""},{"$f":"IF(F69=0,\"\",'SUB. 4'!F30)","v":""},{"$f":"'SUB. 4'!Q30","v":0},{"$f":"'SUB. 4'!R30","v":0},null,{"$f":"N69","v":0},{"$f":"N69","v":0},{"$f":"N69","v":0},{"$f":"N69","v":0},0]
[null,{"$f":"IF(F70=0,\"\",'SUB. 4'!B31:D31)","v":""},{"$f":"IF(F70=0,\"\",'SUB. 4'!E31)","v":""},{"$f":"IF(F70=0,\"\",'SUB. 4'!F31)","v":""},{"$f":"'SUB. 4'!Q31","v":0},{"$f":"'SUB. 4'!R31","v":0},null,0,0,0,0,0]
[null,{"$f":"IF(F71=0,\"\",'SUB. 4'!B32:D32)","v":""},{"$f":"IF(F71=0,\"\",'SUB. 4'!E32)","v":""},{"$f":"IF(F71=0,\"\",'SUB. 4'!F32)","v":""},{"$f":"'SUB. 4'!Q32","v":0},{"$f":"'SUB. 4'!R32","v":0},null,0,0,0,0,{"$f":"N71","v":0}]
[null,{"$f":"IF(F72=0,\"\",'SUB. 4'!B33:D33)","v":""},{"$f":"IF(F72=0,\"\",'SUB. 4'!E33)","v":""},{"$f":"IF(F72=0,\"\",'SUB. 4'!F33)","v":""},{"$f":"'SUB. 4'!Q33","v":0},{"$f":"'SUB. 4'!R33","v":0},null,0,0,0,0,0]
[null,{"$f":"IF(F73=0,\"\",'SUB. 4'!B34:D34)","v":""},{"$f":"IF(F73=0,\"\",'SUB. 4'!E34)","v":""},{"$f":"IF(F73=0,\"\",'SUB. 4'!F34)","v":""},{"$f":"'SUB. 4'!Q34","v":0},{"$f":"'SUB. 4'!R34","v":0},null,0,0,0,0,0]
[null,{"$f":"IF(F74=0,\"\",'SUB. 4'!B35:D35)","v":""},{"$f":"IF(F74=0,\"\",'SUB. 4'!E35)","v":""},{"$f":"IF(F74=0,\"\",'SUB. 4'!F35)","v":""},{"$f":"'SUB. 4'!Q35","v":0},{"$f":"'SUB. 4'!R35","v":0},null,0,0,0,0,0]
[null,{"$f":"IF(F75=0,\"\",'SUB. 4'!B36:D36)","v":""},{"$f":"IF(F75=0,\"\",'SUB. 4'!E36)","v":""},{"$f":"IF(F75=0,\"\",'SUB. 4'!F36)","v":""},{"$f":"'SUB. 4'!Q36","v":0},{"$f":"'SUB. 4'!R36","v":0},null,0,0,0,0,0]
["SUBSISTEMA 5",{"$f":"IF(F76=0,\"\",'SUB. 5'!B19:D19)","v":"Palma"},{"$f":"IF(F76=0,\"\",'SUB. 5'!E19)","v":"kg"},{"$f":"IF(F76=0,\"\",'SUB. 5'!F19)","v":0.2},{"$f":"'SUB. 5'!Q19","v":20100},{"$f":"'SUB. 5'!R19","v":4020},null,0,0,0,0,0]
[null,{"$f":"IF(F77=0,\"\",'SUB. 5'!B20:D20)","v":""},{"$f":"IF(F77=0,\"\",'SUB. 5'!E20)","v":""},{"$f":"IF(F77=0,\"\",'SUB. 5'!F20)","v":""},{"$f":"'SUB. 5'!Q20","v":0},{"$f":"'SUB. 5'!R20","v":0},null,0,0,0,0,0]
[null,{"$f":"IF(F78=0,\"\",'SUB. 5'!B21:D21)","v":""},{"$f":"IF(F78=0,\"\",'SUB. 5'!E21)","v":""},{"$f":"IF(F78=0,\"\",'SUB. 5'!F21)","v":""},{"$f":"'SUB. 5'!Q21","v":0},{"$f":"'SUB. 5'!R21","v":0},null,0,0,0,0,0]
[null,{"$f":"IF(F79=0,\"\",'SUB. 5'!B22:D22)","v":""},{"$f":"IF(F79=0,\"\",'SUB. 5'!E22)","v":""},{"$f":"IF(F79=0,\"\",'SUB. 5'!F22)","v":""},{"$f":"'SUB. 5'!Q22","v":0},{"$f":"'SUB. 5'!R22","v":0},null,0,0,0,0,0]
[null,{"$f":"IF(F80=0,\"\",'SUB. 5'!B23:D23)","v":""},{"$f":"IF(F80=0,\"\",'SUB. 5'!E23)","v":""},{"$f":"IF(F80=0,\"\",'SUB. 5'!F23)","v":""},{"$f":"'SUB. 5'!Q23","v":0},{"$f":"'SUB. 5'!R23","v":0},null,0,0,0,0,0]
[null,{"$f":"IF(F81=0,\"\",'SUB. 5'!B24:D24)","v":""},{"$f":"IF(F81=0,\"\",'SUB. 5'!E24)","v":""},{"$f":"IF(F81=0,\"\",'SUB. 5'!F24)","v":""},{"$f":"'SUB. 5'!Q24","v":0},{"$f":"'SUB. 5'!R24","v":0},null,0,0,0,0,0]
[null,{"$f":"IF(F82=0,\"\",'SUB. 5'!B25:D25)","v":""},{"$f":"IF(F82=0,\"\",'SUB. 5'!E25)","v":""},{"$f":"IF(F82=0,\"\",'SUB. 5'!F25)","v":""},{"$f":"'SUB. 5'!Q25","v":0},{"$f":"'SUB. 5'!R25","v":0},null,0,0,0,0,0]
[null,{"$f":"IF(F83=0,\"\",'SUB. 5'!B26:D26)","v":""},{"$f":"IF(F83=0,\"\",'SUB. 5'!E26)","v":""},{"$f":"IF(F83=0,\"\",'SUB. 5'!F26)","v":""},{"$f":"'SUB. 5'!Q26","v":0},{"$f":"'SUB. 5'!R26","v":0},null,0,0,0,0,0]
[null,{"$f":"IF(F84=0,\"\",'SUB. 5'!B27:D27)","v":""},{"$f":"IF(F84=0,\"\",'SUB. 5'!E27)","v":""},{"$f":"IF(F84=0,\"\",'SUB. 5'!F27)","v":""},{"$f":"'SUB. 5'!Q27","v":0},{"$f":"'SUB. 5'!R27","v":0},null,0,0,0,0,0]
[null,{"$f":"IF(F85=0,\"\",'SUB. 5'!B28:D28)","v":""},{"$f":"IF(F85=0,\"\",'SUB. 5'!E28)","v":""},{"$f":"IF(F85=0,\"\",'SUB. 5'!F28)","v":""},{"$f":"'SUB. 5'!Q28","v":0},{"$f":"'SUB. 5'!R28","v":0},null,0,0,0,0,0]
[null,{"$f":"IF(F86=0,\"\",'SUB. 5'!B29:D29)","v":""},{"$f":"IF(F86=0,\"\",'SUB. 5'!E29)","v":""},{"$f":"IF(F86=0,\"\",'SUB. 5'!F29)","v":""},{"$f":"'SUB. 5'!Q29","v":0},{"$f":"'SUB. 5'!R29","v":0},null,0,0,0,0,0]
[null,{"$f":"IF(F87=0,\"\",'SUB. 5'!B30:D30)","v":""},{"$f":"IF(F87=0,\"\",'SUB. 5'!E30)","v":""},{"$f":"IF(F87=0,\"\",'SUB. 5'!F30)","v":""},{"$f":"'SUB. 5'!Q30","v":0},{"$f":"'SUB. 5'!R30","v":0},null,0,0,0,0,0]
[null,{"$f":"IF(F88=0,\"\",'SUB. 5'!B31:D31)","v":""},{"$f":"IF(F88=0,\"\",'SUB. 5'!E31)","v":""},{"$f":"IF(F88=0,\"\",'SUB. 5'!F31)","v":""},{"$f":"'SUB. 5'!Q31","v":0},{"$f":"'SUB. 5'!R31","v":0},null,0,0,0,0,0]
[null,{"$f":"IF(F89=0,\"\",'SUB. 5'!B32:D32)","v":""},{"$f":"IF(F89=0,\"\",'SUB. 5'!E32)","v":""},{"$f":"IF(F89=0,\"\",'SUB. 5'!F32)","v":""},{"$f":"'SUB. 5'!Q32","v":0},{"$f":"'SUB. 5'!R32","v":0},null,0,0,0,0,0]
[null,{"$f":"IF(F90=0,\"\",'SUB. 5'!B33:D33)","v":""},{"$f":"IF(F90=0,\"\",'SUB. 5'!E33)","v":""},{"$f":"IF(F90=0,\"\",'SUB. 5'!F33)","v":""},{"$f":"'SUB. 5'!Q33","v":0},{"$f":"'SUB. 5'!R33","v":0},null,0,0,0,0,0]
[null,{"$f":"IF(F91=0,\"\",'SUB. 5'!B34:D34)","v":""},{"$f":"IF(F91=0,\"\",'SUB. 5'!E34)","v":""},{"$f":"IF(F91=0,\"\",'SUB. 5'!F34)","v":""},{"$f":"'SUB. 5'!Q34","v":0},{"$f":"'SUB. 5'!R34","v":0},null,0,0,0,0,0]
[null,{"$f":"IF(F92=0,\"\",'SUB. 5'!B35:D35)","v":""},{"$f":"IF(F92=0,\"\",'SUB. 5'!E35)","v":""},{"$f":"IF(F92=0,\"\",'SUB. 5'!F35)","v":""},{"$f":"'SUB. 5'!Q35","v":0},{"$f":"'SUB. 5'!R35","v":0},null,0,0,0,0,0]
[null,{"$f":"IF(F93=0,\"\",'SUB. 5'!B36:D36)","v":""},{"$f":"IF(F93=0,\"\",'SUB. 5'!E36)","v":""},{"$f":"IF(F93=0,\"\",'SUB. 5'!F36)","v":""},{"$f":"'SUB. 5'!Q36","v":0},{"$f":"'SUB. 5'!R36","v":0},null,0,0,0,0,0]
["SUBSISTEMA 6",{"$f":"IF(F94=0,\"\",'SUB. 6'!B19:D19)","v":"gliricidea"},{"$f":"IF(F94=0,\"\",'SUB. 6'!E19)","v":"kg"},{"$f":"IF(F94=0,\"\",'SUB. 6'!F19)","v":3},{"$f":"'SUB. 6'!Q19","v":183},{"$f":"'SUB. 6'!R19","v":549},null,0,0,0,0,0]
[null,{"$f":"IF(F95=0,\"\",'SUB. 6'!B20:D20)","v":""},{"$f":"IF(F95=0,\"\",'SUB. 6'!E20)","v":""},{"$f":"IF(F95=0,\"\",'SUB. 6'!F20)","v":""},{"$f":"'SUB. 6'!Q20","v":0},{"$f":"'SUB. 6'!R20","v":0},null,0,0,0,0,0]
[null,{"$f":"IF(F96=0,\"\",'SUB. 6'!B21:D21)","v":""},{"$f":"IF(F96=0,\"\",'SUB. 6'!E21)","v":""},{"$f":"IF(F96=0,\"\",'SUB. 6'!F21)","v":""},{"$f":"'SUB. 6'!Q21","v":0},{"$f":"'SUB. 6'!R21","v":0},null,0,0,0,0,0]
[null,{"$f":"IF(F97=0,\"\",'SUB. 6'!B22:D22)","v":""},{"$f":"IF(F97=0,\"\",'SUB. 6'!E22)","v":""},{"$f":"IF(F97=0,\"\",'SUB. 6'!F22)","v":""},{"$f":"'SUB. 6'!Q22","v":0},{"$f":"'SUB. 6'!R22","v":0},null,0,0,0,0,0]
[null,{"$f":"IF(F98=0,\"\",'SUB. 6'!B23:D23)","v":""},{"$f":"IF(F98=0,\"\",'SUB. 6'!E23)","v":""},{"$f":"IF(F98=0,\"\",'SUB. 6'!F23)","v":""},{"$f":"'SUB. 6'!Q23","v":0},{"$f":"'SUB. 6'!R23","v":0},null,0,0,0,0,0]
[null,{"$f":"IF(F99=0,\"\",'SUB. 6'!B24:D24)","v":""},{"$f":"IF(F99=0,\"\",'SUB. 6'!E24)","v":""},{"$f":"IF(F99=0,\"\",'SUB. 6'!F24)","v":""},{"$f":"'SUB. 6'!Q24","v":0},{"$f":"'SUB. 6'!R24","v":0},null,0,0,0,0,0]
[null,{"$f":"IF(F100=0,\"\",'SUB. 6'!B25:D25)","v":""},{"$f":"IF(F100=0,\"\",'SUB. 6'!E25)","v":""},{"$f":"IF(F100=0,\"\",'SUB. 6'!F25)","v":""},{"$f":"'SUB. 6'!Q25","v":0},{"$f":"'SUB. 6'!R25","v":0},null,0,0,0,0,0]
[null,{"$f":"IF(F101=0,\"\",'SUB. 6'!B26:D26)","v":""},{"$f":"IF(F101=0,\"\",'SUB. 6'!E26)","v":""},{"$f":"IF(F101=0,\"\",'SUB. 6'!F26)","v":""},{"$f":"'SUB. 6'!Q26","v":0},{"$f":"'SUB. 6'!R26","v":0},null,0,0,0,0,0]
[null,{"$f":"IF(F102=0,\"\",'SUB. 6'!B27:D27)","v":""},{"$f":"IF(F102=0,\"\",'SUB. 6'!E27)","v":""},{"$f":"IF(F102=0,\"\",'SUB. 6'!F27)","v":""},{"$f":"'SUB. 6'!Q27","v":0},{"$f":"'SUB. 6'!R27","v":0},null,0,0,0,0,0]
[null,{"$f":"IF(F103=0,\"\",'SUB. 6'!B28:D28)","v":""},{"$f":"IF(F103=0,\"\",'SUB. 6'!E28)","v":""},{"$f":"IF(F103=0,\"\",'SUB. 6'!F28)","v":""},{"$f":"'SUB. 6'!Q28","v":0},{"$f":"'SUB. 6'!R28","v":0},null,0,0,0,0,0]
[null,{"$f":"IF(F104=0,\"\",'SUB. 6'!B29:D29)","v":""},{"$f":"IF(F104=0,\"\",'SUB. 6'!E29)","v":""},{"$f":"IF(F104=0,\"\",'SUB. 6'!F29)","v":""},{"$f":"'SUB. 6'!Q29","v":0},{"$f":"'SUB. 6'!R29","v":0},null,0,0,0,0,0]
[null,{"$f":"IF(F105=0,\"\",'SUB. 6'!B30:D30)","v":""},{"$f":"IF(F105=0,\"\",'SUB. 6'!E30)","v":""},{"$f":"IF(F105=0,\"\",'SUB. 6'!F30)","v":""},{"$f":"'SUB. 6'!Q30","v":0},{"$f":"'SUB. 6'!R30","v":0},null,0,0,0,0,0]
[null,{"$f":"IF(F106=0,\"\",'SUB. 6'!B31:D31)","v":""},{"$f":"IF(F106=0,\"\",'SUB. 6'!E31)","v":""},{"$f":"IF(F106=0,\"\",'SUB. 6'!F31)","v":""},{"$f":"'SUB. 6'!Q31","v":0},{"$f":"'SUB. 6'!R31","v":0},null,0,0,0,0,0]
[null,{"$f":"IF(F107=0,\"\",'SUB. 6'!B32:D32)","v":""},{"$f":"IF(F107=0,\"\",'SUB. 6'!E32)","v":""},{"$f":"IF(F107=0,\"\",'SUB. 6'!F32)","v":""},{"$f":"'SUB. 6'!Q32","v":0},{"$f":"'SUB. 6'!R32","v":0},null,0,0,0,0,0]
[null,{"$f":"IF(F108=0,\"\",'SUB. 6'!B33:D33)","v":""},{"$f":"IF(F108=0,\"\",'SUB. 6'!E33)","v":""},{"$f":"IF(F108=0,\"\",'SUB. 6'!F33)","v":""},{"$f":"'SUB. 6'!Q33","v":0},{"$f":"'SUB. 6'!R33","v":0},null,0,0,0,0,0]
[null,{"$f":"IF(F109=0,\"\",'SUB. 6'!B34:D34)","v":""},{"$f":"IF(F109=0,\"\",'SUB. 6'!E34)","v":""},{"$f":"IF(F109=0,\"\",'SUB. 6'!F34)","v":""},{"$f":"'SUB. 6'!Q34","v":0},{"$f":"'SUB. 6'!R34","v":0},null,0,0,0,0,0]
[null,{"$f":"IF(F110=0,\"\",'SUB. 6'!B35:D35)","v":""},{"$f":"IF(F110=0,\"\",'SUB. 6'!E35)","v":""},{"$f":"IF(F110=0,\"\",'SUB. 6'!F35)","v":""},{"$f":"'SUB. 6'!Q35","v":0},{"$f":"'SUB. 6'!R35","v":0},null,0,0,0,0,0]
[null,{"$f":"IF(F111=0,\"\",'SUB. 6'!B36:D36)","v":""},{"$f":"IF(F111=0,\"\",'SUB. 6'!E36)","v":""},{"$f":"IF(F111=0,\"\",'SUB. 6'!F36)","v":""},{"$f":"'SUB. 6'!Q36","v":0},{"$f":"'SUB. 6'!R36","v":0},null,0,0,0,0,0]
["SUBSISTEMA 7",{"$f":"IF(F112=0,\"\",'SUB. 7'!B19:D19)","v":""},{"$f":"IF(F112=0,\"\",'SUB. 7'!E19)","v":""},{"$f":"IF(F112=0,\"\",'SUB. 7'!F19)","v":""},{"$f":"'SUB. 7'!Q19","v":0},{"$f":"'SUB. 7'!R19","v":0},null,0,0,0,0,0]
[null,{"$f":"IF(F113=0,\"\",'SUB. 7'!B20:D20)","v":""},{"$f":"IF(F113=0,\"\",'SUB. 7'!E20)","v":""},{"$f":"IF(F113=0,\"\",'SUB. 7'!F20)","v":""},{"$f":"'SUB. 7'!Q20","v":0},{"$f":"'SUB. 7'!R20","v":0},null,0,0,0,0,0]
[null,{"$f":"IF(F114=0,\"\",'SUB. 7'!B21:D21)","v":""},{"$f":"IF(F114=0,\"\",'SUB. 7'!E21)","v":""},{"$f":"IF(F114=0,\"\",'SUB. 7'!F21)","v":""},{"$f":"'SUB. 7'!Q21","v":0},{"$f":"'SUB. 7'!R21","v":0},null,0,0,0,0,0]
[null,{"$f":"IF(F115=0,\"\",'SUB. 7'!B22:D22)","v":""},{"$f":"IF(F115=0,\"\",'SUB. 7'!E22)","v":""},{"$f":"IF(F115=0,\"\",'SUB. 7'!F22)","v":""},{"$f":"'SUB. 7'!Q22","v":0},{"$f":"'SUB. 7'!R22","v":0},null,0,0,0,0,0]
[null,{"$f":"IF(F116=0,\"\",'SUB. 7'!B23:D23)","v":""},{"$f":"IF(F116=0,\"\",'SUB. 7'!E23)","v":""},{"$f":"IF(F116=0,\"\",'SUB. 7'!F23)","v":""},{"$f":"'SUB. 7'!Q23","v":0},{"$f":"'SUB. 7'!R23","v":0},null,0,0,0,0,0]
[null,{"$f":"IF(F117=0,\"\",'SUB. 7'!B24:D24)","v":""},{"$f":"IF(F117=0,\"\",'SUB. 7'!E24)","v":""},{"$f":"IF(F117=0,\"\",'SUB. 7'!F24)","v":""},{"$f":"'SUB. 7'!Q24","v":0},{"$f":"'SUB. 7'!R24","v":0},null,0,0,0,0,0]
[null,{"$f":"IF(F118=0,\"\",'SUB. 7'!B25:D25)","v":""},{"$f":"IF(F118=0,\"\",'SUB. 7'!E25)","v":""},{"$f":"IF(F118=0,\"\",'SUB. 7'!F25)","v":""},{"$f":"'SUB. 7'!Q25","v":0},{"$f":"'SUB. 7'!R25","v":0},null,0,0,0,0,0]
[null,{"$f":"IF(F119=0,\"\",'SUB. 7'!B26:D26)","v":""},{"$f":"IF(F119=0,\"\",'SUB. 7'!E26)","v":""},{"$f":"IF(F119=0,\"\",'SUB. 7'!F26)","v":""},{"$f":"'SUB. 7'!Q26","v":0},{"$f":"'SUB. 7'!R26","v":0},null,0,0,0,0,0]
[null,{"$f":"IF(F120=0,\"\",'SUB. 7'!B27:D27)","v":""},{"$f":"IF(F120=0,\"\",'SUB. 7'!E27)","v":""},{"$f":"IF(F120=0,\"\",'SUB. 7'!F27)","v":""},{"$f":"'SUB. 7'!Q27","v":0},{"$f":"'SUB. 7'!R27","v":0},null,0,0,0,0,0]
[null,{"$f":"IF(F121=0,\"\",'SUB. 7'!B28:D28)","v":""},{"$f":"IF(F121=0,\"\",'SUB. 7'!E28)","v":""},{"$f":"IF(F121=0,\"\",'SUB. 7'!F28)","v":""},{"$f":"'SUB. 7'!Q28","v":0},{"$f":"'SUB. 7'!R28","v":0},null,0,0,0,0,0]
[null,{"$f":"IF(F122=0,\"\",'SUB. 7'!B29:D29)","v":""},{"$f":"IF(F122=0,\"\",'SUB. 7'!E29)","v":""},{"$f":"IF(F122=0,\"\",'SUB. 7'!F29)","v":""},{"$f":"'SUB. 7'!Q29","v":0},{"$f":"'SUB. 7'!R29","v":0},null,0,0,0,0,0]
[null,{"$f":"IF(F123=0,\"\",'SUB. 7'!B30:D30)","v":""},{"$f":"IF(F123=0,\"\",'SUB. 7'!E30)","v":""},{"$f":"IF(F123=0,\"\",'SUB. 7'!F30)","v":""},{"$f":"'SUB. 7'!Q30","v":0},{"$f":"'SUB. 7'!R30","v":0},null,0,0,0,0,0]
[null,{"$f":"IF(F124=0,\"\",'SUB. 7'!B31:D31)","v":""},{"$f":"IF(F124=0,\"\",'SUB. 7'!E31)","v":""},{"$f":"IF(F124=0,\"\",'SUB. 7'!F31)","v":""},{"$f":"'SUB. 7'!Q31","v":0},{"$f":"'SUB. 7'!R31","v":0},null,0,0,0,0,0]
[null,{"$f":"IF(F125=0,\"\",'SUB. 7'!B32:D32)","v":""},{"$f":"IF(F125=0,\"\",'SUB. 7'!E32)","v":""},{"$f":"IF(F125=0,\"\",'SUB. 7'!F32)","v":""},{"$f":"'SUB. 7'!Q32","v":0},{"$f":"'SUB. 7'!R32","v":0},null,0,0,0,0,0]
[null,{"$f":"IF(F126=0,\"\",'SUB. 7'!B33:D33)","v":""},{"$f":"IF(F126=0,\"\",'SUB. 7'!E33)","v":""},{"$f":"IF(F126=0,\"\",'SUB. 7'!F33)","v":""},{"$f":"'SUB. 7'!Q33","v":0},{"$f":"'SUB. 7'!R33","v":0},null,0,0,0,0,0]
[null,{"$f":"IF(F127=0,\"\",'SUB. 7'!B34:D34)","v":""},{"$f":"IF(F127=0,\"\",'SUB. 7'!E34)","v":""},{"$f":"IF(F127=0,\"\",'SUB. 7'!F34)","v":""},{"$f":"'SUB. 7'!Q34","v":0},{"$f":"'SUB. 7'!R34","v":0},null,0,0,0,0,0]
[null,{"$f":"IF(F128=0,\"\",'SUB. 7'!B35:D35)","v":""},{"$f":"IF(F128=0,\"\",'SUB. 7'!E35)","v":""},{"$f":"IF(F128=0,\"\",'SUB. 7'!F35)","v":""},{"$f":"'SUB. 7'!Q35","v":0},{"$f":"'SUB. 7'!R35","v":0},null,0,0,0,0,0]
[null,{"$f":"IF(F129=0,\"\",'SUB. 7'!B36:D36)","v":""},{"$f":"IF(F129=0,\"\",'SUB. 7'!E36)","v":""},{"$f":"IF(F129=0,\"\",'SUB. 7'!F36)","v":""},{"$f":"'SUB. 7'!Q36","v":0},{"$f":"'SUB. 7'!R36","v":0},null,0,0,0,0,0]
["SUBSISTEMA 8",{"$f":"IF(F130=0,\"\",'SUB. 8'!B19:D19)","v":""},{"$f":"IF(F130=0,\"\",'SUB. 8'!E19)","v":""},{"$f":"IF(F130=0,\"\",'SUB. 8'!F19)","v":""},{"$f":"'SUB. 8'!Q19","v":0},{"$f":"'SUB. 8'!R19","v":0},null,0,0,0,0,0]
[null,{"$f":"IF(F131=0,\"\",'SUB. 8'!B20:D20)","v":""},{"$f":"IF(F131=0,\"\",'SUB. 8'!E20)","v":""},{"$f":"IF(F131=0,\"\",'SUB. 8'!F20)","v":""},{"$f":"'SUB. 8'!Q20","v":0},{"$f":"'SUB. 8'!R20","v":0},null,0,0,0,0,0]
[null,{"$f":"IF(F132=0,\"\",'SUB. 8'!B21:D21)","v":""},{"$f":"IF(F132=0,\"\",'SUB. 8'!E21)","v":""},{"$f":"IF(F132=0,\"\",'SUB. 8'!F21)","v":""},{"$f":"'SUB. 8'!Q21","v":0},{"$f":"'SUB. 8'!R21","v":0},null,0,0,0,0,0]
[null,{"$f":"IF(F133=0,\"\",'SUB. 8'!B22:D22)","v":""},{"$f":"IF(F133=0,\"\",'SUB. 8'!E22)","v":""},{"$f":"IF(F133=0,\"\",'SUB. 8'!F22)","v":""},{"$f":"'SUB. 8'!Q22","v":0},{"$f":"'SUB. 8'!R22","v":0},null,{"$f":"N133","v":0},{"$f":"N133","v":0},{"$f":"N133","v":0},{"$f":"N133","v":0},0]
[null,{"$f":"IF(F134=0,\"\",'SUB. 8'!B23:D23)","v":""},{"$f":"IF(F134=0,\"\",'SUB. 8'!E23)","v":""},{"$f":"IF(F134=0,\"\",'SUB. 8'!F23)","v":""},{"$f":"'SUB. 8'!Q23","v":0},{"$f":"'SUB. 8'!R23","v":0},null,0,0,0,0,0]
[null,{"$f":"IF(F135=0,\"\",'SUB. 8'!B24:D24)","v":""},{"$f":"IF(F135=0,\"\",'SUB. 8'!E24)","v":""},{"$f":"IF(F135=0,\"\",'SUB. 8'!F24)","v":""},{"$f":"'SUB. 8'!Q24","v":0},{"$f":"'SUB. 8'!R24","v":0},null,0,0,0,0,{"$f":"N135","v":0}]
[null,{"$f":"IF(F136=0,\"\",'SUB. 8'!B25:D25)","v":""},{"$f":"IF(F136=0,\"\",'SUB. 8'!E25)","v":""},{"$f":"IF(F136=0,\"\",'SUB. 8'!F25)","v":""},{"$f":"'SUB. 8'!Q25","v":0},{"$f":"'SUB. 8'!R25","v":0},null,0,0,0,0,0]
[null,{"$f":"IF(F137=0,\"\",'SUB. 8'!B26:D26)","v":""},{"$f":"IF(F137=0,\"\",'SUB. 8'!E26)","v":""},{"$f":"IF(F137=0,\"\",'SUB. 8'!F26)","v":""},{"$f":"'SUB. 8'!Q26","v":0},{"$f":"'SUB. 8'!R26","v":0},null,0,0,0,0,0]
[null,{"$f":"IF(F138=0,\"\",'SUB. 8'!B27:D27)","v":""},{"$f":"IF(F138=0,\"\",'SUB. 8'!E27)","v":""},{"$f":"IF(F138=0,\"\",'SUB. 8'!F27)","v":""},{"$f":"'SUB. 8'!Q27","v":0},{"$f":"'SUB. 8'!R27","v":0},null,0,0,0,0,0]
[null,{"$f":"IF(F139=0,\"\",'SUB. 8'!B28:D28)","v":""},{"$f":"IF(F139=0,\"\",'SUB. 8'!E28)","v":""},{"$f":"IF(F139=0,\"\",'SUB. 8'!F28)","v":""},{"$f":"'SUB. 8'!Q28","v":0},{"$f":"'SUB. 8'!R28","v":0},null,0,0,0,0,0]
[null,{"$f":"IF(F140=0,\"\",'SUB. 8'!B29:D29)","v":""},{"$f":"IF(F140=0,\"\",'SUB. 8'!E29)","v":""},{"$f":"IF(F140=0,\"\",'SUB. 8'!F29)","v":""},{"$f":"'SUB. 8'!Q29","v":0},{"$f":"'SUB. 8'!R29","v":0},null,0,0,0,0,0]
[null,{"$f":"IF(F141=0,\"\",'SUB. 8'!B30:D30)","v":""},{"$f":"IF(F141=0,\"\",'SUB. 8'!E30)","v":""},{"$f":"IF(F141=0,\"\",'SUB. 8'!F30)","v":""},{"$f":"'SUB. 8'!Q30","v":0},{"$f":"'SUB. 8'!R30","v":0},null,0,0,0,0,0]
[null,{"$f":"IF(F142=0,\"\",'SUB. 8'!B31:D31)","v":""},{"$f":"IF(F142=0,\"\",'SUB. 8'!E31)","v":""},{"$f":"IF(F142=0,\"\",'SUB. 8'!F31)","v":""},{"$f":"'SUB. 8'!Q31","v":0},{"$f":"'SUB. 8'!R31","v":0},null,0,0,0,0,0]
[null,{"$f":"IF(F143=0,\"\",'SUB. 8'!B32:D32)","v":""},{"$f":"IF(F143=0,\"\",'SUB. 8'!E32)","v":""},{"$f":"IF(F143=0,\"\",'SUB. 8'!F32)","v":""},{"$f":"'SUB. 8'!Q32","v":0},{"$f":"'SUB. 8'!R32","v":0},null,0,0,0,0,0]
[null,{"$f":"IF(F144=0,\"\",'SUB. 8'!B33:D33)","v":""},{"$f":"IF(F144=0,\"\",'SUB. 8'!E33)","v":""},{"$f":"IF(F144=0,\"\",'SUB. 8'!F33)","v":""},{"$f":"'SUB. 8'!Q33","v":0},{"$f":"'SUB. 8'!R33","v":0},null,0,0,0,0,0]
[null,{"$f":"IF(F145=0,\"\",'SUB. 8'!B34:D34)","v":""},{"$f":"IF(F145=0,\"\",'SUB. 8'!E34)","v":""},{"$f":"IF(F145=0,\"\",'SUB. 8'!F34)","v":""},{"$f":"'SUB. 8'!Q34","v":0},{"$f":"'SUB. 8'!R34","v":0},null,0,0,0,0,0]
[null,{"$f":"IF(F146=0,\"\",'SUB. 8'!B35:D35)","v":""},{"$f":"IF(F146=0,\"\",'SUB. 8'!E35)","v":""},{"$f":"IF(F146=0,\"\",'SUB. 8'!F35)","v":""},{"$f":"'SUB. 8'!Q35","v":0},{"$f":"'SUB. 8'!R35","v":0},null,0,0,0,0,0]
[null,{"$f":"IF(F147=0,\"\",'SUB. 8'!B36:D36)","v":""},{"$f":"IF(F147=0,\"\",'SUB. 8'!E36)","v":""},{"$f":"IF(F147=0,\"\",'SUB. 8'!F36)","v":""},{"$f":"'SUB. 8'!Q36","v":0},{"$f":"'SUB. 8'!R36","v":0},null,0,0,0,0,0]
["SUBSISTEMA 9",{"$f":"IF(F148=0,\"\",'SUB. 9'!B19:D19)","v":""},{"$f":"IF(F148=0,\"\",'SUB. 9'!E19)","v":""},{"$f":"IF(F148=0,\"\",'SUB. 9'!F19)","v":""},{"$f":"'SUB. 9'!Q19","v":0},{"$f":"'SUB. 9'!R19","v":0},null,0,0,0,0,0]
[null,{"$f":"IF(F149=0,\"\",'SUB. 9'!B20:D20)","v":""},{"$f":"IF(F149=0,\"\",'SUB. 9'!E20)","v":""},{"$f":"IF(F149=0,\"\",'SUB. 9'!F20)","v":""},{"$f":"'SUB. 9'!Q20","v":0},{"$f":"'SUB. 9'!R20","v":0},null,0,0,0,0,0]
[null,{"$f":"IF(F150=0,\"\",'SUB. 9'!B21:D21)","v":""},{"$f":"IF(F150=0,\"\",'SUB. 9'!E21)","v":""},{"$f":"IF(F150=0,\"\",'SUB. 9'!F21)","v":""},{"$f":"'SUB. 9'!Q21","v":0},{"$f":"'SUB. 9'!R21","v":0},null,0,0,0,0,0]
[null,{"$f":"IF(F151=0,\"\",'SUB. 9'!B22:D22)","v":""},{"$f":"IF(F151=0,\"\",'SUB. 9'!E22)","v":""},{"$f":"IF(F151=0,\"\",'SUB. 9'!F22)","v":""},{"$f":"'SUB. 9'!Q22","v":0},{"$f":"'SUB. 9'!R22","v":0},null,0,0,0,0,0]
[null,{"$f":"IF(F152=0,\"\",'SUB. 9'!B23:D23)","v":""},{"$f":"IF(F152=0,\"\",'SUB. 9'!E23)","v":""},{"$f":"IF(F152=0,\"\",'SUB. 9'!F23)","v":""},{"$f":"'SUB. 9'!Q23","v":0},{"$f":"'SUB. 9'!R23","v":0},null,0,0,0,0,0]
[null,{"$f":"IF(F153=0,\"\",'SUB. 9'!B24:D24)","v":""},{"$f":"IF(F153=0,\"\",'SUB. 9'!E24)","v":""},{"$f":"IF(F153=0,\"\",'SUB. 9'!F24)","v":""},{"$f":"'SUB. 9'!Q24","v":0},{"$f":"'SUB. 9'!R24","v":0},null,0,0,0,0,0]
[null,{"$f":"IF(F154=0,\"\",'SUB. 9'!B25:D25)","v":""},{"$f":"IF(F154=0,\"\",'SUB. 9'!E25)","v":""},{"$f":"IF(F154=0,\"\",'SUB. 9'!F25)","v":""},{"$f":"'SUB. 9'!Q25","v":0},{"$f":"'SUB. 9'!R25","v":0},null,0,0,0,0,0]
[null,{"$f":"IF(F155=0,\"\",'SUB. 9'!B26:D26)","v":""},{"$f":"IF(F155=0,\"\",'SUB. 9'!E26)","v":""},{"$f":"IF(F155=0,\"\",'SUB. 9'!F26)","v":""},{"$f":"'SUB. 9'!Q26","v":0},{"$f":"'SUB. 9'!R26","v":0},null,0,0,0,0,0]
[null,{"$f":"IF(F156=0,\"\",'SUB. 9'!B27:D27)","v":""},{"$f":"IF(F156=0,\"\",'SUB. 9'!E27)","v":""},{"$f":"IF(F156=0,\"\",'SUB. 9'!F27)","v":""},{"$f":"'SUB. 9'!Q27","v":0},{"$f":"'SUB. 9'!R27","v":0},null,0,0,0,0,0]
[null,{"$f":"IF(F157=0,\"\",'SUB. 9'!B28:D28)","v":""},{"$f":"IF(F157=0,\"\",'SUB. 9'!E28)","v":""},{"$f":"IF(F157=0,\"\",'SUB. 9'!F28)","v":""},{"$f":"'SUB. 9'!Q28","v":0},{"$f":"'SUB. 9'!R28","v":0},null,0,0,0,0,0]
[null,{"$f":"IF(F158=0,\"\",'SUB. 9'!B29:D29)","v":""},{"$f":"IF(F158=0,\"\",'SUB. 9'!E29)","v":""},{"$f":"IF(F158=0,\"\",'SUB. 9'!F29)","v":""},{"$f":"'SUB. 9'!Q29","v":0},{"$f":"'SUB. 9'!R29","v":0},null,0,0,0,0,0]
[null,{"$f":"IF(F159=0,\"\",'SUB. 9'!B30:D30)","v":""},{"$f":"IF(F159=0,\"\",'SUB. 9'!E30)","v":""},{"$f":"IF(F159=0,\"\",'SUB. 9'!F30)","v":""},{"$f":"'SUB. 9'!Q30","v":0},{"$f":"'SUB. 9'!R30","v":0},null,0,0,0,0,0]
[null,{"$f":"IF(F160=0,\"\",'SUB. 9'!B31:D31)","v":""},{"$f":"IF(F160=0,\"\",'SUB. 9'!E31)","v":""},{"$f":"IF(F160=0,\"\",'SUB. 9'!F31)","v":""},{"$f":"'SUB. 9'!Q31","v":0},{"$f":"'SUB. 9'!R31","v":0},null,0,0,0,0,0]
[null,{"$f":"IF(F161=0,\"\",'SUB. 9'!B32:D32)","v":""},{"$f":"IF(F161=0,\"\",'SUB. 9'!E32)","v":""},{"$f":"IF(F161=0,\"\",'SUB. 9'!F32)","v":""},{"$f":"'SUB. 9'!Q32","v":0},{"$f":"'SUB. 9'!R32","v":0},null,0,0,0,0,0]
[null,{"$f":"IF(F162=0,\"\",'SUB. 9'!B33:D33)","v":""},{"$f":"IF(F162=0,\"\",'SUB. 9'!E33)","v":""},{"$f":"IF(F162=0,\"\",'SUB. 9'!F33)","v":""},{"$f":"'SUB. 9'!Q33","v":0},{"$f":"'SUB. 9'!R33","v":0},null,0,0,0,0,0]
[null,{"$f":"IF(F163=0,\"\",'SUB. 9'!B34:D34)","v":""},{"$f":"IF(F163=0,\"\",'SUB. 9'!E34)","v":""},{"$f":"IF(F163=0,\"\",'SUB. 9'!F34)","v":""},{"$f":"'SUB. 9'!Q34","v":0},{"$f":"'SUB. 9'!R34","v":0},null,0,0,0,0,0]
[null,{"$f":"IF(F164=0,\"\",'SUB. 9'!B35:D35)","v":""},{"$f":"IF(F164=0,\"\",'SUB. 9'!E35)","v":""},{"$f":"IF(F164=0,\"\",'SUB. 9'!F35)","v":""},{"$f":"'SUB. 9'!Q35","v":0},{"$f":"'SUB. 9'!R35","v":0},null,0,0,0,0,0]
[null,{"$f":"IF(F165=0,\"\",'SUB. 9'!B36:D36)","v":""},{"$f":"IF(F165=0,\"\",'SUB. 9'!E36)","v":""},{"$f":"IF(F165=0,\"\",'SUB. 9'!F36)","v":""},{"$f":"'SUB. 9'!Q36","v":0},{"$f":"'SUB. 9'!R36","v":0},null,0,0,0,0,0]
["SUBSISTEMA 10",{"$f":"IF(F166=0,\"\",'SUB. 10'!B19:D19)","v":""},{"$f":"IF(F166=0,\"\",'SUB. 10'!E19)","v":""},{"$f":"IF(F166=0,\"\",'SUB. 10'!F19)","v":""},{"$f":"'SUB. 10'!Q19","v":0},{"$f":"'SUB. 10'!R19","v":0},null,0,0,0,0,0]
[null,{"$f":"IF(F167=0,\"\",'SUB. 10'!B20:D20)","v":""},{"$f":"IF(F167=0,\"\",'SUB. 10'!E20)","v":""},{"$f":"IF(F167=0,\"\",'SUB. 10'!F20)","v":""},{"$f":"'SUB. 10'!Q20","v":0},{"$f":"'SUB. 10'!R20","v":0},null,0,0,0,0,0]
[null,{"$f":"IF(F168=0,\"\",'SUB. 10'!B21:D21)","v":""},{"$f":"IF(F168=0,\"\",'SUB. 10'!E21)","v":""},{"$f":"IF(F168=0,\"\",'SUB. 10'!F21)","v":""},{"$f":"'SUB. 10'!Q21","v":0},{"$f":"'SUB. 10'!R21","v":0},null,0,0,0,0,0]
[null,{"$f":"IF(F169=0,\"\",'SUB. 10'!B22:D22)","v":""},{"$f":"IF(F169=0,\"\",'SUB. 10'!E22)","v":""},{"$f":"IF(F169=0,\"\",'SUB. 10'!F22)","v":""},{"$f":"'SUB. 10'!Q22","v":0},{"$f":"'SUB. 10'!R22","v":0},null,0,0,0,0,0]
[null,{"$f":"IF(F170=0,\"\",'SUB. 10'!B23:D23)","v":""},{"$f":"IF(F170=0,\"\",'SUB. 10'!E23)","v":""},{"$f":"IF(F170=0,\"\",'SUB. 10'!F23)","v":""},{"$f":"'SUB. 10'!Q23","v":0},{"$f":"'SUB. 10'!R23","v":0},null,0,0,0,0,0]
[null,{"$f":"IF(F171=0,\"\",'SUB. 10'!B24:D24)","v":""},{"$f":"IF(F171=0,\"\",'SUB. 10'!E24)","v":""},{"$f":"IF(F171=0,\"\",'SUB. 10'!F24)","v":""},{"$f":"'SUB. 10'!Q24","v":0},{"$f":"'SUB. 10'!R24","v":0},null,0,0,0,0,0]
[null,{"$f":"IF(F172=0,\"\",'SUB. 10'!B25:D25)","v":""},{"$f":"IF(F172=0,\"\",'SUB. 10'!E25)","v":""},{"$f":"IF(F172=0,\"\",'SUB. 10'!F25)","v":""},{"$f":"'SUB. 10'!Q25","v":0},{"$f":"'SUB. 10'!R25","v":0},null,0,0,0,0,0]
[null,{"$f":"IF(F173=0,\"\",'SUB. 10'!B26:D26)","v":""},{"$f":"IF(F173=0,\"\",'SUB. 10'!E26)","v":""},{"$f":"IF(F173=0,\"\",'SUB. 10'!F26)","v":""},{"$f":"'SUB. 10'!Q26","v":0},{"$f":"'SUB. 10'!R26","v":0},null,0,0,0,0,0]
[null,{"$f":"IF(F174=0,\"\",'SUB. 10'!B27:D27)","v":""},{"$f":"IF(F174=0,\"\",'SUB. 10'!E27)","v":""},{"$f":"IF(F174=0,\"\",'SUB. 10'!F27)","v":""},{"$f":"'SUB. 10'!Q27","v":0},{"$f":"'SUB. 10'!R27","v":0},null,0,0,0,0,0]
[null,{"$f":"IF(F175=0,\"\",'SUB. 10'!B28:D28)","v":""},{"$f":"IF(F175=0,\"\",'SUB. 10'!E28)","v":""},{"$f":"IF(F175=0,\"\",'SUB. 10'!F28)","v":""},{"$f":"'SUB. 10'!Q28","v":0},{"$f":"'SUB. 10'!R28","v":0},null,0,0,0,0,0]
[null,{"$f":"IF(F176=0,\"\",'SUB. 10'!B29:D29)","v":""},{"$f":"IF(F176=0,\"\",'SUB. 10'!E29)","v":""},{"$f":"IF(F176=0,\"\",'SUB. 10'!F29)","v":""},{"$f":"'SUB. 10'!Q29","v":0},{"$f":"'SUB. 10'!R29","v":0},null,0,0,0,0,0]
[null,{"$f":"IF(F177=0,\"\",'SUB. 10'!B30:D30)","v":""},{"$f":"IF(F177=0,\"\",'SUB. 10'!E30)","v":""},{"$f":"IF(F177=0,\"\",'SUB. 10'!F30)","v":""},{"$f":"'SUB. 10'!Q30","v":0},{"$f":"'SUB. 10'!R30","v":0},null,0,0,0,0,0]
[null,{"$f":"IF(F178=0,\"\",'SUB. 10'!B31:D31)","v":""},{"$f":"IF(F178=0,\"\",'SUB. 10'!E31)","v":""},{"$f":"IF(F178=0,\"\",'SUB. 10'!F31)","v":""},{"$f":"'SUB. 10'!Q31","v":0},{"$f":"'SUB. 10'!R31","v":0},null,0,0,0,0,0]
[null,{"$f":"IF(F179=0,\"\",'SUB. 10'!B32:D32)","v":""},{"$f":"IF(F179=0,\"\",'SUB. 10'!E32)","v":""},{"$f":"IF(F179=0,\"\",'SUB. 10'!F32)","v":""},{"$f":"'SUB. 10'!Q32","v":0},{"$f":"'SUB. 10'!R32","v":0},null,0,0,0,0,0]
[null,{"$f":"IF(F180=0,\"\",'SUB. 10'!B33:D33)","v":""},{"$f":"IF(F180=0,\"\",'SUB. 10'!E33)","v":""},{"$f":"IF(F180=0,\"\",'SUB. 10'!F33)","v":""},{"$f":"'SUB. 10'!Q33","v":0},{"$f":"'SUB. 10'!R33","v":0},null,0,0,0,0,0]
[null,{"$f":"IF(F181=0,\"\",'SUB. 10'!B34:D34)","v":""},{"$f":"IF(F181=0,\"\",'SUB. 10'!E34)","v":""},{"$f":"IF(F181=0,\"\",'SUB. 10'!F34)","v":""},{"$f":"'SUB. 10'!Q34","v":0},{"$f":"'SUB. 10'!R34","v":0},null,0,0,0,0,0]
[null,{"$f":"IF(F182=0,\"\",'SUB. 10'!B35:D35)","v":""},{"$f":"IF(F182=0,\"\",'SUB. 10'!E35)","v":""},{"$f":"IF(F182=0,\"\",'SUB. 10'!F35)","v":""},{"$f":"'SUB. 10'!Q35","v":0},{"$f":"'SUB. 10'!R35","v":0},null,0,0,0,0,0]
[null,{"$f":"IF(F183=0,\"\",'SUB. 10'!B36:D36)","v":""},{"$f":"IF(F183=0,\"\",'SUB. 10'!E36)","v":""},{"$f":"IF(F183=0,\"\",'SUB. 10'!F36)","v":""},{"$f":"'SUB. 10'!Q36","v":0},{"$f":"'SUB. 10'!R36","v":0},null,0,0,0,0,0]
["SUBSISTEMA 11",{"$f":"IF(F184=0,\"\",'SUB. 11'!B19:D19)","v":""},{"$f":"IF(F184=0,\"\",'SUB. 11'!E19)","v":""},{"$f":"IF(F184=0,\"\",'SUB. 11'!F19)","v":""},{"$f":"'SUB. 11'!Q19","v":0},{"$f":"'SUB. 11'!R19","v":0},null,0,0,0,0,0]
[null,{"$f":"IF(F185=0,\"\",'SUB. 11'!B20:D20)","v":""},{"$f":"IF(F185=0,\"\",'SUB. 11'!E20)","v":""},{"$f":"IF(F185=0,\"\",'SUB. 11'!F20)","v":""},{"$f":"'SUB. 11'!Q20","v":0},{"$f":"'SUB. 11'!R20","v":0},null,0,0,0,0,0]
[null,{"$f":"IF(F186=0,\"\",'SUB. 11'!B21:D21)","v":""},{"$f":"IF(F186=0,\"\",'SUB. 11'!E21)","v":""},{"$f":"IF(F186=0,\"\",'SUB. 11'!F21)","v":""},{"$f":"'SUB. 11'!Q21","v":0},{"$f":"'SUB. 11'!R21","v":0},null,0,0,0,0,0]
[null,{"$f":"IF(F187=0,\"\",'SUB. 11'!B22:D22)","v":""},{"$f":"IF(F187=0,\"\",'SUB. 11'!E22)","v":""},{"$f":"IF(F187=0,\"\",'SUB. 11'!F22)","v":""},{"$f":"'SUB. 11'!Q22","v":0},{"$f":"'SUB. 11'!R22","v":0},null,0,0,0,0,0]
[null,{"$f":"IF(F188=0,\"\",'SUB. 11'!B23:D23)","v":""},{"$f":"IF(F188=0,\"\",'SUB. 11'!E23)","v":""},{"$f":"IF(F188=0,\"\",'SUB. 11'!F23)","v":""},{"$f":"'SUB. 11'!Q23","v":0},{"$f":"'SUB. 11'!R23","v":0},null,0,0,0,0,0]
[null,{"$f":"IF(F189=0,\"\",'SUB. 11'!B24:D24)","v":""},{"$f":"IF(F189=0,\"\",'SUB. 11'!E24)","v":""},{"$f":"IF(F189=0,\"\",'SUB. 11'!F24)","v":""},{"$f":"'SUB. 11'!Q24","v":0},{"$f":"'SUB. 11'!R24","v":0},null,0,0,0,0,0]
[null,{"$f":"IF(F190=0,\"\",'SUB. 11'!B25:D25)","v":""},{"$f":"IF(F190=0,\"\",'SUB. 11'!E25)","v":""},{"$f":"IF(F190=0,\"\",'SUB. 11'!F25)","v":""},{"$f":"'SUB. 11'!Q25","v":0},{"$f":"'SUB. 11'!R25","v":0},null,0,0,0,0,0]
[null,{"$f":"IF(F191=0,\"\",'SUB. 11'!B26:D26)","v":""},{"$f":"IF(F191=0,\"\",'SUB. 11'!E26)","v":""},{"$f":"IF(F191=0,\"\",'SUB. 11'!F26)","v":""},{"$f":"'SUB. 11'!Q26","v":0},{"$f":"'SUB. 11'!R26","v":0},null,0,0,0,0,0]
[null,{"$f":"IF(F192=0,\"\",'SUB. 11'!B27:D27)","v":""},{"$f":"IF(F192=0,\"\",'SUB. 11'!E27)","v":""},{"$f":"IF(F192=0,\"\",'SUB. 11'!F27)","v":""},{"$f":"'SUB. 11'!Q27","v":0},{"$f":"'SUB. 11'!R27","v":0},null,0,0,0,0,0]
[null,{"$f":"IF(F193=0,\"\",'SUB. 11'!B28:D28)","v":""},{"$f":"IF(F193=0,\"\",'SUB. 11'!E28)","v":""},{"$f":"IF(F193=0,\"\",'SUB. 11'!F28)","v":""},{"$f":"'SUB. 11'!Q28","v":0},{"$f":"'SUB. 11'!R28","v":0},null,0,0,0,0,0]
[null,{"$f":"IF(F194=0,\"\",'SUB. 11'!B29:D29)","v":""},{"$f":"IF(F194=0,\"\",'SUB. 11'!E29)","v":""},{"$f":"IF(F194=0,\"\",'SUB. 11'!F29)","v":""},{"$f":"'SUB. 11'!Q29","v":0},{"$f":"'SUB. 11'!R29","v":0},null,0,0,0,0,0]
[null,{"$f":"IF(F195=0,\"\",'SUB. 11'!B30:D30)","v":""},{"$f":"IF(F195=0,\"\",'SUB. 11'!E30)","v":""},{"$f":"IF(F195=0,\"\",'SUB. 11'!F30)","v":""},{"$f":"'SUB. 11'!Q30","v":0},{"$f":"'SUB. 11'!R30","v":0},null,0,0,0,0,0]
[null,{"$f":"IF(F196=0,\"\",'SUB. 11'!B31:D31)","v":""},{"$f":"IF(F196=0,\"\",'SUB. 11'!E31)","v":""},{"$f":"IF(F196=0,\"\",'SUB. 11'!F31)","v":""},{"$f":"'SUB. 11'!Q31","v":0},{"$f":"'SUB. 11'!R31","v":0},null,0,0,0,0,0]
[null,{"$f":"IF(F197=0,\"\",'SUB. 11'!B32:D32)","v":""},{"$f":"IF(F197=0,\"\",'SUB. 11'!E32)","v":""},{"$f":"IF(F197=0,\"\",'SUB. 11'!F32)","v":""},{"$f":"'SUB. 11'!Q32","v":0},{"$f":"'SUB. 11'!R32","v":0},null,{"$f":"N197","v":0},{"$f":"N197","v":0},{"$f":"N197","v":0},{"$f":"N197","v":0},0]
[null,{"$f":"IF(F198=0,\"\",'SUB. 11'!B33:D33)","v":""},{"$f":"IF(F198=0,\"\",'SUB. 11'!E33)","v":""},{"$f":"IF(F198=0,\"\",'SUB. 11'!F33)","v":""},{"$f":"'SUB. 11'!Q33","v":0},{"$f":"'SUB. 11'!R33","v":0},null,0,0,0,0,0]
[null,{"$f":"IF(F199=0,\"\",'SUB. 11'!B34:D34)","v":""},{"$f":"IF(F199=0,\"\",'SUB. 11'!E34)","v":""},{"$f":"IF(F199=0,\"\",'SUB. 11'!F34)","v":""},{"$f":"'SUB. 11'!Q34","v":0},{"$f":"'SUB. 11'!R34","v":0},null,0,0,0,0,{"$f":"N199","v":0}]
[null,{"$f":"IF(F200=0,\"\",'SUB. 11'!B35:D35)","v":""},{"$f":"IF(F200=0,\"\",'SUB. 11'!E35)","v":""},{"$f":"IF(F200=0,\"\",'SUB. 11'!F35)","v":""},{"$f":"'SUB. 11'!Q35","v":0},{"$f":"'SUB. 11'!R35","v":0},null,0,0,0,0,0]
[null,{"$f":"IF(F201=0,\"\",'SUB. 11'!B36:D36)","v":""},{"$f":"IF(F201=0,\"\",'SUB. 11'!E36)","v":""},{"$f":"IF(F201=0,\"\",'SUB. 11'!F36)","v":""},{"$f":"'SUB. 11'!Q36","v":0},{"$f":"'SUB. 11'!R36","v":0},null,0,0,0,0,0]
["SUBSISTEMA 12",{"$f":"IF(F202=0,\"\",'SUB. 12'!B19:D19)","v":""},{"$f":"IF(F202=0,\"\",'SUB. 12'!E19)","v":""},{"$f":"IF(F202=0,\"\",'SUB. 12'!F19)","v":""},{"$f":"'SUB. 12'!Q19","v":0},{"$f":"'SUB. 12'!R19","v":0},null,0,0,0,0,0]
[null,{"$f":"IF(F203=0,\"\",'SUB. 12'!B20:D20)","v":""},{"$f":"IF(F203=0,\"\",'SUB. 12'!E20)","v":""},{"$f":"IF(F203=0,\"\",'SUB. 12'!F20)","v":""},{"$f":"'SUB. 12'!Q20","v":0},{"$f":"'SUB. 12'!R20","v":0},null,0,0,0,0,0]
[null,{"$f":"IF(F204=0,\"\",'SUB. 12'!B21:D21)","v":""},{"$f":"IF(F204=0,\"\",'SUB. 12'!E21)","v":""},{"$f":"IF(F204=0,\"\",'SUB. 12'!F21)","v":""},{"$f":"'SUB. 12'!Q21","v":0},{"$f":"'SUB. 12'!R21","v":0},null,0,0,0,0,0]
[null,{"$f":"IF(F205=0,\"\",'SUB. 12'!B22:D22)","v":""},{"$f":"IF(F205=0,\"\",'SUB. 12'!E22)","v":""},{"$f":"IF(F205=0,\"\",'SUB. 12'!F22)","v":""},{"$f":"'SUB. 12'!Q22","v":0},{"$f":"'SUB. 12'!R22","v":0},null,0,0,0,0,0]
[null,{"$f":"IF(F206=0,\"\",'SUB. 12'!B23:D23)","v":""},{"$f":"IF(F206=0,\"\",'SUB. 12'!E23)","v":""},{"$f":"IF(F206=0,\"\",'SUB. 12'!F23)","v":""},{"$f":"'SUB. 12'!Q23","v":0},{"$f":"'SUB. 12'!R23","v":0},null,0,0,0,0,0]
[null,{"$f":"IF(F207=0,\"\",'SUB. 12'!B24:D24)","v":""},{"$f":"IF(F207=0,\"\",'SUB. 12'!E24)","v":""},{"$f":"IF(F207=0,\"\",'SUB. 12'!F24)","v":""},{"$f":"'SUB. 12'!Q24","v":0},{"$f":"'SUB. 12'!R24","v":0},null,0,0,0,0,0]
[null,{"$f":"IF(F208=0,\"\",'SUB. 12'!B25:D25)","v":""},{"$f":"IF(F208=0,\"\",'SUB. 12'!E25)","v":""},{"$f":"IF(F208=0,\"\",'SUB. 12'!F25)","v":""},{"$f":"'SUB. 12'!Q25","v":0},{"$f":"'SUB. 12'!R25","v":0},null,0,0,0,0,0]
[null,{"$f":"IF(F209=0,\"\",'SUB. 12'!B26:D26)","v":""},{"$f":"IF(F209=0,\"\",'SUB. 12'!E26)","v":""},{"$f":"IF(F209=0,\"\",'SUB. 12'!F26)","v":""},{"$f":"'SUB. 12'!Q26","v":0},{"$f":"'SUB. 12'!R26","v":0},null,0,0,0,0,0]
[null,{"$f":"IF(F210=0,\"\",'SUB. 12'!B27:D27)","v":""},{"$f":"IF(F210=0,\"\",'SUB. 12'!E27)","v":""},{"$f":"IF(F210=0,\"\",'SUB. 12'!F27)","v":""},{"$f":"'SUB. 12'!Q27","v":0},{"$f":"'SUB. 12'!R27","v":0},null,0,0,0,0,0]
[null,{"$f":"IF(F211=0,\"\",'SUB. 12'!B28:D28)","v":""},{"$f":"IF(F211=0,\"\",'SUB. 12'!E28)","v":""},{"$f":"IF(F211=0,\"\",'SUB. 12'!F28)","v":""},{"$f":"'SUB. 12'!Q28","v":0},{"$f":"'SUB. 12'!R28","v":0},null,0,0,0,0,0]
[null,{"$f":"IF(F212=0,\"\",'SUB. 12'!B29:D29)","v":""},{"$f":"IF(F212=0,\"\",'SUB. 12'!E29)","v":""},{"$f":"IF(F212=0,\"\",'SUB. 12'!F29)","v":""},{"$f":"'SUB. 12'!Q29","v":0},{"$f":"'SUB. 12'!R29","v":0},null,0,0,0,0,0]
[null,{"$f":"IF(F213=0,\"\",'SUB. 12'!B30:D30)","v":""},{"$f":"IF(F213=0,\"\",'SUB. 12'!E30)","v":""},{"$f":"IF(F213=0,\"\",'SUB. 12'!F30)","v":""},{"$f":"'SUB. 12'!Q30","v":0},{"$f":"'SUB. 12'!R30","v":0},null,0,0,0,0,0]
[null,{"$f":"IF(F214=0,\"\",'SUB. 12'!B31:D31)","v":""},{"$f":"IF(F214=0,\"\",'SUB. 12'!E31)","v":""},{"$f":"IF(F214=0,\"\",'SUB. 12'!F31)","v":""},{"$f":"'SUB. 12'!Q31","v":0},{"$f":"'SUB. 12'!R31","v":0},null,0,0,0,0,0]
[null,{"$f":"IF(F215=0,\"\",'SUB. 12'!B32:D32)","v":""},{"$f":"IF(F215=0,\"\",'SUB. 12'!E32)","v":""},{"$f":"IF(F215=0,\"\",'SUB. 12'!F32)","v":""},{"$f":"'SUB. 12'!Q32","v":0},{"$f":"'SUB. 12'!R32","v":0},null,0,0,0,0,0]
[null,{"$f":"IF(F216=0,\"\",'SUB. 12'!B33:D33)","v":""},{"$f":"IF(F216=0,\"\",'SUB. 12'!E33)","v":""},{"$f":"IF(F216=0,\"\",'SUB. 12'!F33)","v":""},{"$f":"'SUB. 12'!Q33","v":0},{"$f":"'SUB. 12'!R33","v":0},null,0,0,0,0,0]
[null,{"$f":"IF(F217=0,\"\",'SUB. 12'!B34:D34)","v":""},{"$f":"IF(F217=0,\"\",'SUB. 12'!E34)","v":""},{"$f":"IF(F217=0,\"\",'SUB. 12'!F34)","v":""},{"$f":"'SUB. 12'!Q34","v":0},{"$f":"'SUB. 12'!R34","v":0},null,0,0,0,0,0]
[null,{"$f":"IF(F218=0,\"\",'SUB. 12'!B35:D35)","v":""},{"$f":"IF(F218=0,\"\",'SUB. 12'!E35)","v":""},{"$f":"IF(F218=0,\"\",'SUB. 12'!F35)","v":""},{"$f":"'SUB. 12'!Q35","v":0},{"$f":"'SUB. 12'!R35","v":0},null,0,0,0,0,0]
[null,{"$f":"IF(F219=0,\"\",'SUB. 12'!B36:D36)","v":""},{"$f":"IF(F219=0,\"\",'SUB. 12'!E36)","v":""},{"$f":"IF(F219=0,\"\",'SUB. 12'!F36)","v":""},{"$f":"'SUB. 12'!Q36","v":0},{"$f":"'SUB. 12'!R36","v":0},null,0,0,0,0,0]
["SUBSISTEMA 13",{"$f":"IF(F220=0,\"\",'SUB. Extrativista'!B19:D19)","v":""},{"$f":"IF(F220=0,\"\",'SUB. Extrativista'!E19)","v":""},{"$f":"IF(F220=0,\"\",'SUB. Extrativista'!F19)","v":""},{"$f":"'SUB. Extrativista'!Q19","v":0},{"$f":"'SUB. Extrativista'!R19","v":0},null,0,0,0,0,0]
[null,{"$f":"IF(F221=0,\"\",'SUB. Extrativista'!B20:D20)","v":""},{"$f":"IF(F221=0,\"\",'SUB. Extrativista'!E20)","v":""},{"$f":"IF(F221=0,\"\",'SUB. Extrativista'!F20)","v":""},{"$f":"'SUB. Extrativista'!Q20","v":0},{"$f":"'SUB. Extrativista'!R20","v":0},null,0,0,0,0,0]
[null,{"$f":"IF(F222=0,\"\",'SUB. Extrativista'!B21:D21)","v":""},{"$f":"IF(F222=0,\"\",'SUB. Extrativista'!E21)","v":""},{"$f":"IF(F222=0,\"\",'SUB. Extrativista'!F21)","v":""},{"$f":"'SUB. Extrativista'!Q21","v":0},{"$f":"'SUB. Extrativista'!R21","v":0},null,0,0,0,0,0]
[null,{"$f":"IF(F223=0,\"\",'SUB. Extrativista'!B22:D22)","v":""},{"$f":"IF(F223=0,\"\",'SUB. Extrativista'!E22)","v":""},{"$f":"IF(F223=0,\"\",'SUB. Extrativista'!F22)","v":""},{"$f":"'SUB. Extrativista'!Q22","v":0},{"$f":"'SUB. Extrativista'!R22","v":0},null,0,0,0,0,0]
[null,{"$f":"IF(F224=0,\"\",'SUB. Extrativista'!B23:D23)","v":""},{"$f":"IF(F224=0,\"\",'SUB. Extrativista'!E23)","v":""},{"$f":"IF(F224=0,\"\",'SUB. Extrativista'!F23)","v":""},{"$f":"'SUB. Extrativista'!Q23","v":0},{"$f":"'SUB. Extrativista'!R23","v":0},null,0,0,0,0,0]
[null,{"$f":"IF(F225=0,\"\",'SUB. Extrativista'!B24:D24)","v":""},{"$f":"IF(F225=0,\"\",'SUB. Extrativista'!E24)","v":""},{"$f":"IF(F225=0,\"\",'SUB. Extrativista'!F24)","v":""},{"$f":"'SUB. Extrativista'!Q24","v":0},{"$f":"'SUB. Extrativista'!R24","v":0},null,0,0,0,0,0]
[null,{"$f":"IF(F226=0,\"\",'SUB. Extrativista'!B25:D25)","v":""},{"$f":"IF(F226=0,\"\",'SUB. Extrativista'!E25)","v":""},{"$f":"IF(F226=0,\"\",'SUB. Extrativista'!F25)","v":""},{"$f":"'SUB. Extrativista'!Q25","v":0},{"$f":"'SUB. Extrativista'!R25","v":0},null,0,0,0,0,0]
[null,{"$f":"IF(F227=0,\"\",'SUB. Extrativista'!B26:D26)","v":""},{"$f":"IF(F227=0,\"\",'SUB. Extrativista'!E26)","v":""},{"$f":"IF(F227=0,\"\",'SUB. Extrativista'!F26)","v":""},{"$f":"'SUB. Extrativista'!Q26","v":0},{"$f":"'SUB. Extrativista'!R26","v":0},null,0,0,0,0,0]
[null,{"$f":"IF(F228=0,\"\",'SUB. Extrativista'!B27:D27)","v":""},{"$f":"IF(F228=0,\"\",'SUB. Extrativista'!E27)","v":""},{"$f":"IF(F228=0,\"\",'SUB. Extrativista'!F27)","v":""},{"$f":"'SUB. Extrativista'!Q27","v":0},{"$f":"'SUB. Extrativista'!R27","v":0},null,0,0,0,0,0]
[null,{"$f":"IF(F229=0,\"\",'SUB. Extrativista'!B28:D28)","v":""},{"$f":"IF(F229=0,\"\",'SUB. Extrativista'!E28)","v":""},{"$f":"IF(F229=0,\"\",'SUB. Extrativista'!F28)","v":""},{"$f":"'SUB. Extrativista'!Q28","v":0},{"$f":"'SUB. Extrativista'!R28","v":0},null,0,0,0,0,0]
[null,{"$f":"IF(F230=0,\"\",'SUB. Extrativista'!B29:D29)","v":""},{"$f":"IF(F230=0,\"\",'SUB. Extrativista'!E29)","v":""},{"$f":"IF(F230=0,\"\",'SUB. Extrativista'!F29)","v":""},{"$f":"'SUB. Extrativista'!Q29","v":0},{"$f":"'SUB. Extrativista'!R29","v":0},null,0,0,0,0,0]
[null,{"$f":"IF(F231=0,\"\",'SUB. Extrativista'!B30:D30)","v":""},{"$f":"IF(F231=0,\"\",'SUB. Extrativista'!E30)","v":""},{"$f":"IF(F231=0,\"\",'SUB. Extrativista'!F30)","v":""},{"$f":"'SUB. Extrativista'!Q30","v":0},{"$f":"'SUB. Extrativista'!R30","v":0},null,0,0,0,0,0]
[null,{"$f":"IF(F232=0,\"\",'SUB. Extrativista'!B31:D31)","v":""},{"$f":"IF(F232=0,\"\",'SUB. Extrativista'!E31)","v":""},{"$f":"IF(F232=0,\"\",'SUB. Extrativista'!F31)","v":""},{"$f":"'SUB. Extrativista'!Q31","v":0},{"$f":"'SUB. Extrativista'!R31","v":0},null,0,0,0,0,0]
[null,{"$f":"IF(F233=0,\"\",'SUB. Extrativista'!B32:D32)","v":""},{"$f":"IF(F233=0,\"\",'SUB. Extrativista'!E32)","v":""},{"$f":"IF(F233=0,\"\",'SUB. Extrativista'!F32)","v":""},{"$f":"'SUB. Extrativista'!Q32","v":0},{"$f":"'SUB. Extrativista'!R32","v":0},null,0,0,0,0,0]
[null,{"$f":"IF(F234=0,\"\",'SUB. Extrativista'!B33:D33)","v":""},{"$f":"IF(F234=0,\"\",'SUB. Extrativista'!E33)","v":""},{"$f":"IF(F234=0,\"\",'SUB. Extrativista'!F33)","v":""},{"$f":"'SUB. Extrativista'!Q33","v":0},{"$f":"'SUB. Extrativista'!R33","v":0},null,0,0,0,0,0]
[null,{"$f":"IF(F235=0,\"\",'SUB. Extrativista'!B34:D34)","v":""},{"$f":"IF(F235=0,\"\",'SUB. Extrativista'!E34)","v":""},{"$f":"IF(F235=0,\"\",'SUB. Extrativista'!F34)","v":""},{"$f":"'SUB. Extrativista'!Q34","v":0},{"$f":"'SUB. Extrativista'!R34","v":0},null,0,0,0,0,0]
[null,{"$f":"IF(F236=0,\"\",'SUB. Extrativista'!B35:D35)","v":""},{"$f":"IF(F236=0,\"\",'SUB. Extrativista'!E35)","v":""},{"$f":"IF(F236=0,\"\",'SUB. Extrativista'!F35)","v":""},{"$f":"'SUB. Extrativista'!Q35","v":0},{"$f":"'SUB. Extrativista'!R35","v":0},null,0,0,0,0,0]
[null,{"$f":"IF(F237=0,\"\",'SUB. Extrativista'!B36:D36)","v":""},{"$f":"IF(F237=0,\"\",'SUB. Extrativista'!E36)","v":""},{"$f":"IF(F237=0,\"\",'SUB. Extrativista'!F36)","v":""},{"$f":"'SUB. Extrativista'!Q36","v":0},{"$f":"'SUB. Extrativista'!R36","v":0},null,0,0,0,0,0]
["SUBSISTEMA 1",{"$f":"'SUB. 1'!B42:D42","v":"silagem"},{"$f":"'SUB. 1'!E42","v":"ton"},{"$f":"'SUB. 1'!F42","v":300},{"$f":"N238","v":0},{"$f":"N238","v":0},{"$f":"'SUB. 1'!G42","v":10},{"$f":"'SUB. 1'!H42","v":3000},0,0,0,0]
[null,{"$f":"'SUB. 1'!B43:D43","v":"palha"},{"$f":"'SUB. 1'!E43","v":"kg"},{"$f":"'SUB. 1'!F43","v":0.4},{"$f":"N239","v":0},{"$f":"N239","v":0},{"$f":"'SUB. 1'!G43","v":1800},{"$f":"'SUB. 1'!H43","v":720},0,0,0,0]
[null,{"$f":"'SUB. 1'!B44:D44","v":"palma"},{"$f":"'SUB. 1'!E44","v":"kg"},{"$f":"'SUB. 1'!F44","v":0.2},{"$f":"N240","v":0},0,{"$f":"'SUB. 1'!G44","v":20100},{"$f":"'SUB. 1'!H44","v":4020},0,0,0,0]
[null,{"$f":"'SUB. 1'!B45:D45","v":0},{"$f":"'SUB. 1'!E45","v":0},{"$f":"'SUB. 1'!F45","v":0},0,0,{"$f":"'SUB. 1'!G45","v":0},{"$f":"'SUB. 1'!H45","v":0},0,0,0,0]
[null,{"$f":"'SUB. 1'!B46:D46","v":0},{"$f":"'SUB. 1'!E46","v":0},{"$f":"'SUB. 1'!F46","v":0},0,0,{"$f":"'SUB. 1'!G46","v":0},{"$f":"'SUB. 1'!H46","v":0},0,0,0,0]
[null,{"$f":"'SUB. 1'!B47:D47","v":0},{"$f":"'SUB. 1'!E47","v":0},{"$f":"'SUB. 1'!F47","v":0},0,0,{"$f":"'SUB. 1'!G47","v":0},{"$f":"'SUB. 1'!H47","v":0},0,0,0,0]
[null,{"$f":"'SUB. 1'!B48:D48","v":0},{"$f":"'SUB. 1'!E48","v":0},{"$f":"'SUB. 1'!F48","v":0},0,0,{"$f":"'SUB. 1'!G48","v":0},{"$f":"'SUB. 1'!H48","v":0},0,0,0,0]
[null,{"$f":"'SUB. 1'!B49:D49","v":0},{"$f":"'SUB. 1'!E49","v":0},{"$f":"'SUB. 1'!F49","v":0},0,0,{"$f":"'SUB. 1'!G49","v":0},{"$f":"'SUB. 1'!H49","v":0},0,0,0,0]
[null,{"$f":"'SUB. 1'!B50:D50","v":0},{"$f":"'SUB. 1'!E50","v":0},{"$f":"'SUB. 1'!F50","v":0},0,0,{"$f":"'SUB. 1'!G50","v":0},{"$f":"'SUB. 1'!H50","v":0},0,0,0,0]
[null,{"$f":"'SUB. 1'!B51:D51","v":0},{"$f":"'SUB. 1'!E51","v":0},{"$f":"'SUB. 1'!F51","v":0},0,0,{"$f":"'SUB. 1'!G51","v":0},{"$f":"'SUB. 1'!H51","v":0},0,0,0,0]
[null,{"$f":"'SUB. 1'!B52:D52","v":0},{"$f":"'SUB. 1'!E52","v":0},{"$f":"'SUB. 1'!F52","v":0},0,0,{"$f":"'SUB. 1'!G52","v":0},{"$f":"'SUB. 1'!H52","v":0},0,0,0,0]
[null,{"$f":"'SUB. 1'!B53:D53","v":0},{"$f":"'SUB. 1'!E53","v":0},{"$f":"'SUB. 1'!F53","v":0},0,0,{"$f":"'SUB. 1'!G53","v":0},{"$f":"'SUB. 1'!H53","v":0},0,0,0,0]
[null,{"$f":"'SUB. 1'!B54:D54","v":0},{"$f":"'SUB. 1'!E54","v":0},{"$f":"'SUB. 1'!F54","v":0},0,0,{"$f":"'SUB. 1'!G54","v":0},{"$f":"'SUB. 1'!H54","v":0},0,0,0,0]
[null,{"$f":"'SUB. 1'!B55:D55","v":0},{"$f":"'SUB. 1'!E55","v":0},{"$f":"'SUB. 1'!F55","v":0},0,0,{"$f":"'SUB. 1'!G55","v":0},{"$f":"'SUB. 1'!H55","v":0},0,0,0,0]
[null,{"$f":"'SUB. 1'!B56:D56","v":0},{"$f":"'SUB. 1'!E56","v":0},{"$f":"'SUB. 1'!F56","v":0},0,0,{"$f":"'SUB. 1'!G56","v":0},{"$f":"'SUB. 1'!H56","v":0},0,0,0,0]
["SUBSISTEMA 2",{"$f":"'SUB. 2'!B42:D42","v":0},{"$f":"'SUB. 2'!E42","v":0},{"$f":"'SUB. 2'!F42","v":0},0,0,{"$f":"'SUB. 2'!G42","v":0},{"$f":"'SUB. 2'!H42","v":0},0,0,0,0]
[null,{"$f":"'SUB. 2'!B43:D43","v":0},{"$f":"'SUB. 2'!E43","v":0},{"$f":"'SUB. 2'!F43","v":0},0,0,{"$f":"'SUB. 2'!G43","v":0},{"$f":"'SUB. 2'!H43","v":0},0,0,0,0]
[null,{"$f":"'SUB. 2'!B44:D44","v":0},{"$f":"'SUB. 2'!E44","v":0},{"$f":"'SUB. 2'!F44","v":0},0,0,{"$f":"'SUB. 2'!G44","v":0},{"$f":"'SUB. 2'!H44","v":0},0,0,0,0]
[null,{"$f":"'SUB. 2'!B45:D45","v":0},{"$f":"'SUB. 2'!E45","v":0},{"$f":"'SUB. 2'!F45","v":0},0,0,{"$f":"'SUB. 2'!G45","v":0},{"$f":"'SUB. 2'!H45","v":0},0,0,0,0]
[null,{"$f":"'SUB. 2'!B46:D46","v":0},{"$f":"'SUB. 2'!E46","v":0},{"$f":"'SUB. 2'!F46","v":0},0,0,{"$f":"'SUB. 2'!G46","v":0},{"$f":"'SUB. 2'!H46","v":0},0,0,0,0]
[null,{"$f":"'SUB. 2'!B47:D47","v":0},{"$f":"'SUB. 2'!E47","v":0},{"$f":"'SUB. 2'!F47","v":0},0,0,{"$f":"'SUB. 2'!G47","v":0},{"$f":"'SUB. 2'!H47","v":0},0,0,0,0]
[null,{"$f":"'SUB. 2'!B48:D48","v":0},{"$f":"'SUB. 2'!E48","v":0},{"$f":"'SUB. 2'!F48","v":0},0,0,{"$f":"'SUB. 2'!G48","v":0},{"$f":"'SUB. 2'!H48","v":0},0,0,0,0]
[null,{"$f":"'SUB. 2'!B49:D49","v":0},{"$f":"'SUB. 2'!E49","v":0},{"$f":"'SUB. 2'!F49","v":0},0,0,{"$f":"'SUB. 2'!G49","v":0},{"$f":"'SUB. 2'!H49","v":0},0,0,0,0]
[null,{"$f":"'SUB. 2'!B50:D50","v":0},{"$f":"'SUB. 2'!E50","v":0},{"$f":"'SUB. 2'!F50","v":0},0,0,{"$f":"'SUB. 2'!G50","v":0},{"$f":"'SUB. 2'!H50","v":0},{"$f":"N261","v":0},{"$f":"N261","v":0},{"$f":"N261","v":0},0]
[null,{"$f":"'SUB. 2'!B51:D51","v":0},{"$f":"'SUB. 2'!E51","v":0},{"$f":"'SUB. 2'!F51","v":0},0,0,{"$f":"'SUB. 2'!G51","v":0},{"$f":"'SUB. 2'!H51","v":0},0,0,0,0]
[null,{"$f":"'SUB. 2'!B52:D52","v":0},{"$f":"'SUB. 2'!E52","v":0},{"$f":"'SUB. 2'!F52","v":0},0,0,{"$f":"'SUB. 2'!G52","v":0},{"$f":"'SUB. 2'!H52","v":0},0,0,0,{"$f":"N263","v":0}]
[null,{"$f":"'SUB. 2'!B53:D53","v":0},{"$f":"'SUB. 2'!E53","v":0},{"$f":"'SUB. 2'!F53","v":0},0,0,{"$f":"'SUB. 2'!G53","v":0},{"$f":"'SUB. 2'!H53","v":0},0,0,0,0]
[null,{"$f":"'SUB. 2'!B54:D54","v":0},{"$f":"'SUB. 2'!E54","v":0},{"$f":"'SUB. 2'!F54","v":0},0,0,{"$f":"'SUB. 2'!G54","v":0},{"$f":"'SUB. 2'!H54","v":0},0,0,0,0]
[null,{"$f":"'SUB. 2'!B55:D55","v":0},{"$f":"'SUB. 2'!E55","v":0},{"$f":"'SUB. 2'!F55","v":0},0,0,{"$f":"'SUB. 2'!G55","v":0},{"$f":"'SUB. 2'!H55","v":0},0,0,0,0]
[null,{"$f":"'SUB. 2'!B56:D56","v":0},{"$f":"'SUB. 2'!E56","v":0},{"$f":"'SUB. 2'!F56","v":0},0,0,{"$f":"'SUB. 2'!G56","v":0},{"$f":"'SUB. 2'!H56","v":0},0,0,0,0]
["SUBSISTEMA 3",{"$f":"'SUB. 3'!B42:D42","v":"palha de milho"},{"$f":"'SUB. 3'!E42","v":"kg"},{"$f":"'SUB. 3'!F42","v":0.4},0,0,{"$f":"'SUB. 3'!G42","v":45},{"$f":"'SUB. 3'!H42","v":18},0,0,0,0]
[null,{"$f":"'SUB. 3'!B43:D43","v":"palma"},{"$f":"'SUB. 3'!E43","v":"kg"},{"$f":"'SUB. 3'!F43","v":1},0,0,{"$f":"'SUB. 3'!G43","v":1825},{"$f":"'SUB. 3'!H43","v":1825},0,0,0,0]
[null,{"$f":"'SUB. 3'!B44:D44","v":"ração milho"},{"$f":"'SUB. 3'!E44","v":"kg"},{"$f":"'SUB. 3'!F44","v":1},0,0,{"$f":"'SUB. 3'!G44","v":300},{"$f":"'SUB. 3'!H44","v":300},0,0,0,0]
[null,{"$f":"'SUB. 3'!B45:D45","v":"silo"},{"$f":"'SUB. 3'!E45","v":"kg"},{"$f":"'SUB. 3'!F45","v":0.3},0,0,{"$f":"'SUB. 3'!G45","v":365},{"$f":"'SUB. 3'!H45","v":109.5},0,0,0,0]
[null,{"$f":"'SUB. 3'!B46:D46","v":0},{"$f":"'SUB. 3'!E46","v":0},{"$f":"'SUB. 3'!F46","v":0},0,0,{"$f":"'SUB. 3'!G46","v":0},{"$f":"'SUB. 3'!H46","v":0},0,0,0,0]
[null,{"$f":"'SUB. 3'!B47:D47","v":0},{"$f":"'SUB. 3'!E47","v":0},{"$f":"'SUB. 3'!F47","v":0},0,0,{"$f":"'SUB. 3'!G47","v":0},{"$f":"'SUB. 3'!H47","v":0},0,0,0,0]
[null,{"$f":"'SUB. 3'!B48:D48","v":0},{"$f":"'SUB. 3'!E48","v":0},{"$f":"'SUB. 3'!F48","v":0},0,0,{"$f":"'SUB. 3'!G48","v":0},{"$f":"'SUB. 3'!H48","v":0},0,0,0,0]
[null,{"$f":"'SUB. 3'!B49:D49","v":0},{"$f":"'SUB. 3'!E49","v":0},{"$f":"'SUB. 3'!F49","v":0},0,0,{"$f":"'SUB. 3'!G49","v":0},{"$f":"'SUB. 3'!H49","v":0},0,0,0,0]
[null,{"$f":"'SUB. 3'!B50:D50","v":0},{"$f":"'SUB. 3'!E50","v":0},{"$f":"'SUB. 3'!F50","v":0},0,0,{"$f":"'SUB. 3'!G50","v":0},{"$f":"'SUB. 3'!H50","v":0},0,0,0,0]
[null,{"$f":"'SUB. 3'!B51:D51","v":0},{"$f":"'SUB. 3'!E51","v":0},{"$f":"'SUB. 3'!F51","v":0},0,0,{"$f":"'SUB. 3'!G51","v":0},{"$f":"'SUB. 3'!H51","v":0},0,0,0,0]
[null,{"$f":"'SUB. 3'!B52:D52","v":0},{"$f":"'SUB. 3'!E52","v":0},{"$f":"'SUB. 3'!F52","v":0},0,0,{"$f":"'SUB. 3'!G52","v":0},{"$f":"'SUB. 3'!H52","v":0},0,0,0,0]
[null,{"$f":"'SUB. 3'!B53:D53","v":0},{"$f":"'SUB. 3'!E53","v":0},{"$f":"'SUB. 3'!F53","v":0},0,0,{"$f":"'SUB. 3'!G53","v":0},{"$f":"'SUB. 3'!H53","v":0},0,0,0,0]
[null,{"$f":"'SUB. 3'!B54:D54","v":0},{"$f":"'SUB. 3'!E54","v":0},{"$f":"'SUB. 3'!F54","v":0},0,0,{"$f":"'SUB. 3'!G54","v":0},{"$f":"'SUB. 3'!H54","v":0},0,0,0,0]
[null,{"$f":"'SUB. 3'!B55:D55","v":0},{"$f":"'SUB. 3'!E55","v":0},{"$f":"'SUB. 3'!F55","v":0},0,0,{"$f":"'SUB. 3'!G55","v":0},{"$f":"'SUB. 3'!H55","v":0},0,0,0,0]
[null,{"$f":"'SUB. 3'!B56:D56","v":0},{"$f":"'SUB. 3'!E56","v":0},{"$f":"'SUB. 3'!F56","v":0},0,0,{"$f":"'SUB. 3'!G56","v":0},{"$f":"'SUB. 3'!H56","v":0},0,0,0,0]
["SUBSISTEMA 4",{"$f":"'SUB. 4'!B42:D42","v":0},{"$f":"'SUB. 4'!E42","v":0},{"$f":"'SUB. 4'!G42","v":0},0,0,{"$f":"'SUB. 4'!F42","v":0},{"$f":"'SUB. 4'!H42","v":0},0,0,0,0]
[null,{"$f":"'SUB. 4'!B43:D43","v":0},{"$f":"'SUB. 4'!E43","v":0},{"$f":"'SUB. 4'!G43","v":0},0,0,{"$f":"'SUB. 4'!F43","v":0},{"$f":"'SUB. 4'!H43","v":0},0,0,0,0]
[null,{"$f":"'SUB. 4'!B44:D44","v":0},{"$f":"'SUB. 4'!E44","v":0},{"$f":"'SUB. 4'!G44","v":0},0,0,{"$f":"'SUB. 4'!F44","v":0},{"$f":"'SUB. 4'!H44","v":0},0,0,0,0]
[null,{"$f":"'SUB. 4'!B45:D45","v":0},{"$f":"'SUB. 4'!E45","v":0},{"$f":"'SUB. 4'!G45","v":0},0,0,{"$f":"'SUB. 4'!F45","v":0},{"$f":"'SUB. 4'!H45","v":0},0,0,0,0]
[null,{"$f":"'SUB. 4'!B46:D46","v":0},{"$f":"'SUB. 4'!E46","v":0},{"$f":"'SUB. 4'!G46","v":0},0,0,{"$f":"'SUB. 4'!F46","v":0},{"$f":"'SUB. 4'!H46","v":0},0,0,0,0]
[null,{"$f":"'SUB. 4'!B47:D47","v":0},{"$f":"'SUB. 4'!E47","v":0},{"$f":"'SUB. 4'!G47","v":0},0,0,{"$f":"'SUB. 4'!F47","v":0},{"$f":"'SUB. 4'!H47","v":0},0,0,0,0]
[null,{"$f":"'SUB. 4'!B48:D48","v":0},{"$f":"'SUB. 4'!E48","v":0},{"$f":"'SUB. 4'!G48","v":0},0,0,{"$f":"'SUB. 4'!F48","v":0},{"$f":"'SUB. 4'!H48","v":0},0,0,0,0]
[null,{"$f":"'SUB. 4'!B49:D49","v":0},{"$f":"'SUB. 4'!E49","v":0},{"$f":"'SUB. 4'!G49","v":0},0,0,{"$f":"'SUB. 4'!F49","v":0},{"$f":"'SUB. 4'!H49","v":0},0,0,0,0]
[null,{"$f":"'SUB. 4'!B50:D50","v":0},{"$f":"'SUB. 4'!E50","v":0},{"$f":"'SUB. 4'!G50","v":0},0,0,{"$f":"'SUB. 4'!F50","v":0},{"$f":"'SUB. 4'!H50","v":0},0,0,0,0]
[null,{"$f":"'SUB. 4'!B51:D51","v":0},{"$f":"'SUB. 4'!E51","v":0},{"$f":"'SUB. 4'!G51","v":0},0,0,{"$f":"'SUB. 4'!F51","v":0},{"$f":"'SUB. 4'!H51","v":0},0,0,0,0]
[null,{"$f":"'SUB. 4'!B52:D52","v":0},{"$f":"'SUB. 4'!E52","v":0},{"$f":"'SUB. 4'!G52","v":0},0,0,{"$f":"'SUB. 4'!F52","v":0},{"$f":"'SUB. 4'!H52","v":0},0,0,0,0]
[null,{"$f":"'SUB. 4'!B53:D53","v":0},{"$f":"'SUB. 4'!E53","v":0},{"$f":"'SUB. 4'!G53","v":0},0,0,{"$f":"'SUB. 4'!F53","v":0},{"$f":"'SUB. 4'!H53","v":0},0,0,0,0]
[null,{"$f":"'SUB. 4'!B54:D54","v":0},{"$f":"'SUB. 4'!E54","v":0},{"$f":"'SUB. 4'!G54","v":0},0,0,{"$f":"'SUB. 4'!F54","v":0},{"$f":"'SUB. 4'!H54","v":0},0,0,0,0]
[null,{"$f":"'SUB. 4'!B55:D55","v":0},{"$f":"'SUB. 4'!E55","v":0},{"$f":"'SUB. 4'!G55","v":0},0,0,{"$f":"'SUB. 4'!F55","v":0},{"$f":"'SUB. 4'!H55","v":0},0,0,0,0]
[null,{"$f":"'SUB. 4'!B56:D56","v":0},{"$f":"'SUB. 4'!E56","v":0},{"$f":"'SUB. 4'!G56","v":0},0,0,{"$f":"'SUB. 4'!F56","v":0},{"$f":"'SUB. 4'!H56","v":0},0,0,0,0]
["SUBSISTEMA 5",{"$f":"'SUB. 5'!B42:D42","v":"esterco galinha"},{"$f":"'SUB. 5'!E42","v":"kg"},{"$f":"'SUB. 5'!F42","v":0.42},0,0,{"$f":"'SUB. 5'!G42","v":75},{"$f":"'SUB. 5'!H42","v":31.5},0,0,0,0]
[null,{"$f":"'SUB. 5'!B43:D43","v":"esterco ovnos"},{"$f":"'SUB. 5'!E43","v":"kg"},{"$f":"'SUB. 5'!F43","v":0.42},0,0,{"$f":"'SUB. 5'!G43","v":75},{"$f":"'SUB. 5'!H43","v":31.5},0,0,0,0]
[null,{"$f":"'SUB. 5'!B44:D44","v":0},{"$f":"'SUB. 5'!E44","v":0},{"$f":"'SUB. 5'!F44","v":0},0,0,{"$f":"'SUB. 5'!G44","v":0},{"$f":"'SUB. 5'!H44","v":0},0,0,0,0]
[null,{"$f":"'SUB. 5'!B45:D45","v":0},{"$f":"'SUB. 5'!E45","v":0},{"$f":"'SUB. 5'!F45","v":0},0,0,{"$f":"'SUB. 5'!G45","v":0},{"$f":"'SUB. 5'!H45","v":0},0,0,0,0]
[null,{"$f":"'SUB. 5'!B46:D46","v":0},{"$f":"'SUB. 5'!E46","v":0},{"$f":"'SUB. 5'!F46","v":0},0,0,{"$f":"'SUB. 5'!G46","v":0},{"$f":"'SUB. 5'!H46","v":0},0,0,0,0]
[null,{"$f":"'SUB. 5'!B47:D47","v":0},{"$f":"'SUB. 5'!E47","v":0},{"$f":"'SUB. 5'!F47","v":0},0,{"$f":"N303","v":0},{"$f":"'SUB. 5'!G47","v":0},{"$f":"'SUB. 5'!H47","v":0},0,0,0,0]
[null,{"$f":"'SUB. 5'!B48:D48","v":0},{"$f":"'SUB. 5'!E48","v":0},{"$f":"'SUB. 5'!F48","v":0},{"$f":"N304","v":0},0,{"$f":"'SUB. 5'!G48","v":0},{"$f":"'SUB. 5'!H48","v":0},0,0,0,0]
[null,{"$f":"'SUB. 5'!B49:D49","v":0},{"$f":"'SUB. 5'!E49","v":0},{"$f":"'SUB. 5'!F49","v":0},0,0,{"$f":"'SUB. 5'!G49","v":0},{"$f":"'SUB. 5'!H49","v":0},0,0,0,0]
[null,{"$f":"'SUB. 5'!B50:D50","v":0},{"$f":"'SUB. 5'!E50","v":0},{"$f":"'SUB. 5'!F50","v":0},0,0,{"$f":"'SUB. 5'!G50","v":0},{"$f":"'SUB. 5'!H50","v":0},0,0,0,0]
[null,{"$f":"'SUB. 5'!B51:D51","v":0},{"$f":"'SUB. 5'!E51","v":0},{"$f":"'SUB. 5'!F51","v":0},0,0,{"$f":"'SUB. 5'!G51","v":0},{"$f":"'SUB. 5'!H51","v":0},0,0,0,0]
[null,{"$f":"'SUB. 5'!B52:D52","v":0},{"$f":"'SUB. 5'!E52","v":0},{"$f":"'SUB. 5'!F52","v":0},0,0,{"$f":"'SUB. 5'!G52","v":0},{"$f":"'SUB. 5'!H52","v":0},0,0,0,0]
[null,{"$f":"'SUB. 5'!B53:D53","v":0},{"$f":"'SUB. 5'!E53","v":0},{"$f":"'SUB. 5'!F53","v":0},0,0,{"$f":"'SUB. 5'!G53","v":0},{"$f":"'SUB. 5'!H53","v":0},0,0,0,0]
[null,{"$f":"'SUB. 5'!B54:D54","v":0},{"$f":"'SUB. 5'!E54","v":0},{"$f":"'SUB. 5'!F54","v":0},0,0,{"$f":"'SUB. 5'!G54","v":0},{"$f":"'SUB. 5'!H54","v":0},0,0,0,0]
[null,{"$f":"'SUB. 5'!B55:D55","v":0},{"$f":"'SUB. 5'!E55","v":0},{"$f":"'SUB. 5'!F55","v":0},0,0,{"$f":"'SUB. 5'!G55","v":0},{"$f":"'SUB. 5'!H55","v":0},0,0,0,0]
[null,{"$f":"'SUB. 5'!B56:D56","v":0},{"$f":"'SUB. 5'!E56","v":0},{"$f":"'SUB. 5'!F56","v":0},0,0,{"$f":"'SUB. 5'!G56","v":0},{"$f":"'SUB. 5'!H56","v":0},0,0,0,0]
["SUBSISTEMA 6",{"$f":"'SUB. 6'!B42:D42","v":"esterco"},{"$f":"'SUB. 6'!E42","v":"kg"},{"$f":"'SUB. 6'!F42","v":0.42},0,0,{"$f":"'SUB. 6'!G42","v":60},{"$f":"'SUB. 6'!H42","v":25.2},0,0,0,0]
[null,{"$f":"'SUB. 6'!B43:D43","v":0},{"$f":"'SUB. 6'!E43","v":0},{"$f":"'SUB. 6'!F43","v":0},0,0,{"$f":"'SUB. 6'!G43","v":0},{"$f":"'SUB. 6'!H43","v":0},0,0,0,0]
[null,{"$f":"'SUB. 6'!B44:D44","v":0},{"$f":"'SUB. 6'!E44","v":0},{"$f":"'SUB. 6'!F44","v":0},0,0,{"$f":"'SUB. 6'!G44","v":0},{"$f":"'SUB. 6'!H44","v":0},0,0,0,0]
[null,{"$f":"'SUB. 6'!B45:D45","v":0},{"$f":"'SUB. 6'!E45","v":0},{"$f":"'SUB. 6'!F45","v":0},0,0,{"$f":"'SUB. 6'!G45","v":0},{"$f":"'SUB. 6'!H45","v":0},0,0,0,0]
[null,{"$f":"'SUB. 6'!B46:D46","v":0},{"$f":"'SUB. 6'!E46","v":0},{"$f":"'SUB. 6'!F46","v":0},0,0,{"$f":"'SUB. 6'!G46","v":0},{"$f":"'SUB. 6'!H46","v":0},0,0,0,0]
[null,{"$f":"'SUB. 6'!B47:D47","v":0},{"$f":"'SUB. 6'!E47","v":0},{"$f":"'SUB. 6'!F47","v":0},0,0,{"$f":"'SUB. 6'!G47","v":0},{"$f":"'SUB. 6'!H47","v":0},0,0,0,0]
[null,{"$f":"'SUB. 6'!B48:D48","v":0},{"$f":"'SUB. 6'!E48","v":0},{"$f":"'SUB. 6'!F48","v":0},0,0,{"$f":"'SUB. 6'!G48","v":0},{"$f":"'SUB. 6'!H48","v":0},0,0,0,0]
[null,{"$f":"'SUB. 6'!B49:D49","v":0},{"$f":"'SUB. 6'!E49","v":0},{"$f":"'SUB. 6'!F49","v":0},0,0,{"$f":"'SUB. 6'!G49","v":0},{"$f":"'SUB. 6'!H49","v":0},0,0,0,0]
[null,{"$f":"'SUB. 6'!B50:D50","v":0},{"$f":"'SUB. 6'!E50","v":0},{"$f":"'SUB. 6'!F50","v":0},0,0,{"$f":"'SUB. 6'!G50","v":0},{"$f":"'SUB. 6'!H50","v":0},0,0,0,0]
[null,{"$f":"'SUB. 6'!B51:D51","v":0},{"$f":"'SUB. 6'!E51","v":0},{"$f":"'SUB. 6'!F51","v":0},0,0,{"$f":"'SUB. 6'!G51","v":0},{"$f":"'SUB. 6'!H51","v":0},0,0,0,0]
[null,{"$f":"'SUB. 6'!B52:D52","v":0},{"$f":"'SUB. 6'!E52","v":0},{"$f":"'SUB. 6'!F52","v":0},0,0,{"$f":"'SUB. 6'!G52","v":0},{"$f":"'SUB. 6'!H52","v":0},0,0,0,0]
[null,{"$f":"'SUB. 6'!B53:D53","v":0},{"$f":"'SUB. 6'!E53","v":0},{"$f":"'SUB. 6'!F53","v":0},0,0,{"$f":"'SUB. 6'!G53","v":0},{"$f":"'SUB. 6'!H53","v":0},0,0,0,0]
[null,{"$f":"'SUB. 6'!B54:D54","v":0},{"$f":"'SUB. 6'!E54","v":0},{"$f":"'SUB. 6'!F54","v":0},0,0,{"$f":"'SUB. 6'!G54","v":0},{"$f":"'SUB. 6'!H54","v":0},{"$f":"N325","v":0},{"$f":"N325","v":0},{"$f":"N325","v":0},0]
[null,{"$f":"'SUB. 6'!B55:D55","v":0},{"$f":"'SUB. 6'!E55","v":0},{"$f":"'SUB. 6'!F55","v":0},0,0,{"$f":"'SUB. 6'!G55","v":0},{"$f":"'SUB. 6'!H55","v":0},0,0,0,0]
[null,{"$f":"'SUB. 6'!B56:D56","v":0},{"$f":"'SUB. 6'!E56","v":0},{"$f":"'SUB. 6'!F56","v":0},0,0,{"$f":"'SUB. 6'!G56","v":0},{"$f":"'SUB. 6'!H56","v":0},0,0,0,{"$f":"N327","v":0}]
["SUBSISTEMA 7",{"$f":"'SUB. 7'!B42:D42","v":0},{"$f":"'SUB. 7'!E42","v":0},{"$f":"'SUB. 7'!F42","v":0},0,0,{"$f":"'SUB. 7'!G42","v":0},{"$f":"'SUB. 7'!H42","v":0},0,0,0,0]
[null,{"$f":"'SUB. 7'!B43:D43","v":0},{"$f":"'SUB. 7'!E43","v":0},{"$f":"'SUB. 7'!F43","v":0},0,0,{"$f":"'SUB. 7'!G43","v":0},{"$f":"'SUB. 7'!H43","v":0},0,0,0,0]
[null,{"$f":"'SUB. 7'!B44:D44","v":0},{"$f":"'SUB. 7'!E44","v":0},{"$f":"'SUB. 7'!F44","v":0},0,0,{"$f":"'SUB. 7'!G44","v":0},{"$f":"'SUB. 7'!H44","v":0},0,0,0,0]
[null,{"$f":"'SUB. 7'!B45:D45","v":0},{"$f":"'SUB. 7'!E45","v":0},{"$f":"'SUB. 7'!F45","v":0},0,0,{"$f":"'SUB. 7'!G45","v":0},{"$f":"'SUB. 7'!H45","v":0},0,0,0,0]
[null,{"$f":"'SUB. 7'!B46:D46","v":0},{"$f":"'SUB. 7'!E46","v":0},{"$f":"'SUB. 7'!F46","v":0},0,0,{"$f":"'SUB. 7'!G46","v":0},{"$f":"'SUB. 7'!H46","v":0},0,0,0,0]
[null,{"$f":"'SUB. 7'!B47:D47","v":0},{"$f":"'SUB. 7'!E47","v":0},{"$f":"'SUB. 7'!F47","v":0},0,0,{"$f":"'SUB. 7'!G47","v":0},{"$f":"'SUB. 7'!H47","v":0},0,0,0,0]
[null,{"$f":"'SUB. 7'!B48:D48","v":0},{"$f":"'SUB. 7'!E48","v":0},{"$f":"'SUB. 7'!F48","v":0},0,0,{"$f":"'SUB. 7'!G48","v":0},{"$f":"'SUB. 7'!H48","v":0},0,0,0,0]
[null,{"$f":"'SUB. 7'!B49:D49","v":0},{"$f":"'SUB. 7'!E49","v":0},{"$f":"'SUB. 7'!F49","v":0},0,0,{"$f":"'SUB. 7'!G49","v":0},{"$f":"'SUB. 7'!H49","v":0},0,0,0,0]
[null,{"$f":"'SUB. 7'!B50:D50","v":0},{"$f":"'SUB. 7'!E50","v":0},{"$f":"'SUB. 7'!F50","v":0},0,0,{"$f":"'SUB. 7'!G50","v":0},{"$f":"'SUB. 7'!H50","v":0},0,0,0,0]
[null,{"$f":"'SUB. 7'!B51:D51","v":0},{"$f":"'SUB. 7'!E51","v":0},{"$f":"'SUB. 7'!F51","v":0},0,0,{"$f":"'SUB. 7'!G51","v":0},{"$f":"'SUB. 7'!H51","v":0},0,0,0,0]
[null,{"$f":"'SUB. 7'!B52:D52","v":0},{"$f":"'SUB. 7'!E52","v":0},{"$f":"'SUB. 7'!F52","v":0},0,0,{"$f":"'SUB. 7'!G52","v":0},{"$f":"'SUB. 7'!H52","v":0},0,0,0,0]
[null,{"$f":"'SUB. 7'!B53:D53","v":0},{"$f":"'SUB. 7'!E53","v":0},{"$f":"'SUB. 7'!F53","v":0},0,0,{"$f":"'SUB. 7'!G53","v":0},{"$f":"'SUB. 7'!H53","v":0},0,0,0,0]
[null,{"$f":"'SUB. 7'!B54:D54","v":0},{"$f":"'SUB. 7'!E54","v":0},{"$f":"'SUB. 7'!F54","v":0},0,0,{"$f":"'SUB. 7'!G54","v":0},{"$f":"'SUB. 7'!H54","v":0},0,0,0,0]
[null,{"$f":"'SUB. 7'!B55:D55","v":0},{"$f":"'SUB. 7'!E55","v":0},{"$f":"'SUB. 7'!F55","v":0},0,0,{"$f":"'SUB. 7'!G55","v":0},{"$f":"'SUB. 7'!H55","v":0},0,0,0,0]
[null,{"$f":"'SUB. 7'!B56:D56","v":0},{"$f":"'SUB. 7'!E56","v":0},{"$f":"'SUB. 7'!F56","v":0},0,0,{"$f":"'SUB. 7'!G56","v":0},{"$f":"'SUB. 7'!H56","v":0},0,0,0,0]
["SUBSISTEMA 8",{"$f":"'SUB. 8'!B42:D42","v":0},{"$f":"'SUB. 8'!E42","v":0},{"$f":"'SUB. 8'!F42","v":0},0,0,{"$f":"'SUB. 8'!G42","v":0},{"$f":"'SUB. 8'!H42","v":0},0,0,0,0]
[null,{"$f":"'SUB. 8'!B43:D43","v":0},{"$f":"'SUB. 8'!E43","v":0},{"$f":"'SUB. 8'!F43","v":0},0,0,{"$f":"'SUB. 8'!G43","v":0},{"$f":"'SUB. 8'!H43","v":0},0,0,0,0]
[null,{"$f":"'SUB. 8'!B44:D44","v":0},{"$f":"'SUB. 8'!E44","v":0},{"$f":"'SUB. 8'!F44","v":0},0,0,{"$f":"'SUB. 8'!G44","v":0},{"$f":"'SUB. 8'!H44","v":0},0,0,0,0]
[null,{"$f":"'SUB. 8'!B45:D45","v":0},{"$f":"'SUB. 8'!E45","v":0},{"$f":"'SUB. 8'!F45","v":0},0,0,{"$f":"'SUB. 8'!G45","v":0},{"$f":"'SUB. 8'!H45","v":0},0,0,0,0]
[null,{"$f":"'SUB. 8'!B46:D46","v":0},{"$f":"'SUB. 8'!E46","v":0},{"$f":"'SUB. 8'!F46","v":0},0,0,{"$f":"'SUB. 8'!G46","v":0},{"$f":"'SUB. 8'!H46","v":0},0,0,0,0]
[null,{"$f":"'SUB. 8'!B47:D47","v":0},{"$f":"'SUB. 8'!E47","v":0},{"$f":"'SUB. 8'!F47","v":0},0,0,{"$f":"'SUB. 8'!G47","v":0},{"$f":"'SUB. 8'!H47","v":0},0,0,0,0]
[null,{"$f":"'SUB. 8'!B48:D48","v":0},{"$f":"'SUB. 8'!E48","v":0},{"$f":"'SUB. 8'!F48","v":0},0,0,{"$f":"'SUB. 8'!G48","v":0},{"$f":"'SUB. 8'!H48","v":0},0,0,0,0]
[null,{"$f":"'SUB. 8'!B49:D49","v":0},{"$f":"'SUB. 8'!E49","v":0},{"$f":"'SUB. 8'!F49","v":0},0,0,{"$f":"'SUB. 8'!G49","v":0},{"$f":"'SUB. 8'!H49","v":0},0,0,0,0]
[null,{"$f":"'SUB. 8'!B50:D50","v":0},{"$f":"'SUB. 8'!E50","v":0},{"$f":"'SUB. 8'!F50","v":0},0,0,{"$f":"'SUB. 8'!G50","v":0},{"$f":"'SUB. 8'!H50","v":0},0,0,0,0]
[null,{"$f":"'SUB. 8'!B51:D51","v":0},{"$f":"'SUB. 8'!E51","v":0},{"$f":"'SUB. 8'!F51","v":0},0,0,{"$f":"'SUB. 8'!G51","v":0},{"$f":"'SUB. 8'!H51","v":0},0,0,0,0]
[null,{"$f":"'SUB. 8'!B52:D52","v":0},{"$f":"'SUB. 8'!E52","v":0},{"$f":"'SUB. 8'!F52","v":0},0,0,{"$f":"'SUB. 8'!G52","v":0},{"$f":"'SUB. 8'!H52","v":0},0,0,0,0]
[null,{"$f":"'SUB. 8'!B53:D53","v":0},{"$f":"'SUB. 8'!E53","v":0},{"$f":"'SUB. 8'!F53","v":0},0,0,{"$f":"'SUB. 8'!G53","v":0},{"$f":"'SUB. 8'!H53","v":0},0,0,0,0]
[null,{"$f":"'SUB. 8'!B54:D54","v":0},{"$f":"'SUB. 8'!E54","v":0},{"$f":"'SUB. 8'!F54","v":0},0,0,{"$f":"'SUB. 8'!G54","v":0},{"$f":"'SUB. 8'!H54","v":0},0,0,0,0]
[null,{"$f":"'SUB. 8'!B55:D55","v":0},{"$f":"'SUB. 8'!E55","v":0},{"$f":"'SUB. 8'!F55","v":0},0,0,{"$f":"'SUB. 8'!G55","v":0},{"$f":"'SUB. 8'!H55","v":0},0,0,0,0]
[null,{"$f":"'SUB. 8'!B56:D56","v":0},{"$f":"'SUB. 8'!E56","v":0},{"$f":"'SUB. 8'!F56","v":0},0,0,{"$f":"'SUB. 8'!G56","v":0},{"$f":"'SUB. 8'!H56","v":0},0,0,0,0]
["SUBSISTEMA 9",{"$f":"'SUB. 9'!B42:D42","v":0},{"$f":"'SUB. 9'!E42","v":0},{"$f":"'SUB. 9'!F42","v":0},0,0,{"$f":"'SUB. 9'!G42","v":0},{"$f":"'SUB. 9'!H42","v":0},0,0,0,0]
[null,{"$f":"'SUB. 9'!B43:D43","v":0},{"$f":"'SUB. 9'!E43","v":0},{"$f":"'SUB. 9'!F43","v":0},0,0,{"$f":"'SUB. 9'!G43","v":0},{"$f":"'SUB. 9'!H43","v":0},0,0,0,0]
[null,{"$f":"'SUB. 9'!B44:D44","v":0},{"$f":"'SUB. 9'!E44","v":0},{"$f":"'SUB. 9'!F44","v":0},0,0,{"$f":"'SUB. 9'!G44","v":0},{"$f":"'SUB. 9'!H44","v":0},0,0,0,0]
[null,{"$f":"'SUB. 9'!B45:D45","v":0},{"$f":"'SUB. 9'!E45","v":0},{"$f":"'SUB. 9'!F45","v":0},0,0,{"$f":"'SUB. 9'!G45","v":0},{"$f":"'SUB. 9'!H45","v":0},0,0,0,0]
[null,{"$f":"'SUB. 9'!B46:D46","v":0},{"$f":"'SUB. 9'!E46","v":0},{"$f":"'SUB. 9'!F46","v":0},0,0,{"$f":"'SUB. 9'!G46","v":0},{"$f":"'SUB. 9'!H46","v":0},0,0,0,0]
[null,{"$f":"'SUB. 9'!B47:D47","v":0},{"$f":"'SUB. 9'!E47","v":0},{"$f":"'SUB. 9'!F47","v":0},0,0,{"$f":"'SUB. 9'!G47","v":0},{"$f":"'SUB. 9'!H47","v":0},0,0,0,0]
[null,{"$f":"'SUB. 9'!B48:D48","v":0},{"$f":"'SUB. 9'!E48","v":0},{"$f":"'SUB. 9'!F48","v":0},0,0,{"$f":"'SUB. 9'!G48","v":0},{"$f":"'SUB. 9'!H48","v":0},0,0,0,0]
[null,{"$f":"'SUB. 9'!B49:D49","v":0},{"$f":"'SUB. 9'!E49","v":0},{"$f":"'SUB. 9'!F49","v":0},0,0,{"$f":"'SUB. 9'!G49","v":0},{"$f":"'SUB. 9'!H49","v":0},0,0,0,0]
[null,{"$f":"'SUB. 9'!B50:D50","v":0},{"$f":"'SUB. 9'!E50","v":0},{"$f":"'SUB. 9'!F50","v":0},0,0,{"$f":"'SUB. 9'!G50","v":0},{"$f":"'SUB. 9'!H50","v":0},0,0,0,0]
[null,{"$f":"'SUB. 9'!B51:D51","v":0},{"$f":"'SUB. 9'!E51","v":0},{"$f":"'SUB. 9'!F51","v":0},0,{"$f":"N367","v":0},{"$f":"'SUB. 9'!G51","v":0},{"$f":"'SUB. 9'!H51","v":0},0,0,0,0]
[null,{"$f":"'SUB. 9'!B52:D52","v":0},{"$f":"'SUB. 9'!E52","v":0},{"$f":"'SUB. 9'!F52","v":0},{"$f":"N368","v":0},0,{"$f":"'SUB. 9'!G52","v":0},{"$f":"'SUB. 9'!H52","v":0},0,0,0,0]
[null,{"$f":"'SUB. 9'!B53:D53","v":0},{"$f":"'SUB. 9'!E53","v":0},{"$f":"'SUB. 9'!F53","v":0},0,0,{"$f":"'SUB. 9'!G53","v":0},{"$f":"'SUB. 9'!H53","v":0},0,0,0,0]
[null,{"$f":"'SUB. 9'!B54:D54","v":0},{"$f":"'SUB. 9'!E54","v":0},{"$f":"'SUB. 9'!F54","v":0},0,0,{"$f":"'SUB. 9'!G54","v":0},{"$f":"'SUB. 9'!H54","v":0},0,0,0,0]
[null,{"$f":"'SUB. 9'!B55:D55","v":0},{"$f":"'SUB. 9'!E55","v":0},{"$f":"'SUB. 9'!F55","v":0},0,0,{"$f":"'SUB. 9'!G55","v":0},{"$f":"'SUB. 9'!H55","v":0},0,0,0,0]
[null,{"$f":"'SUB. 9'!B56:D56","v":0},{"$f":"'SUB. 9'!E56","v":0},{"$f":"'SUB. 9'!F56","v":0},0,0,{"$f":"'SUB. 9'!G56","v":0},{"$f":"'SUB. 9'!H56","v":0},0,0,0,0]
["SUBSISTEMA 10",{"$f":"'SUB. 10'!B42:D42","v":0},{"$f":"'SUB. 10'!E42","v":0},{"$f":"'SUB. 10'!F42","v":0},0,0,{"$f":"'SUB. 10'!G42","v":0},{"$f":"'SUB. 10'!H42","v":0},0,0,0,0]
[null,{"$f":"'SUB. 10'!B43:D43","v":0},{"$f":"'SUB. 10'!E43","v":0},{"$f":"'SUB. 10'!F43","v":0},0,0,{"$f":"'SUB. 10'!G43","v":0},{"$f":"'SUB. 10'!H43","v":0},0,0,0,0]
[null,{"$f":"'SUB. 10'!B44:D44","v":0},{"$f":"'SUB. 10'!E44","v":0},{"$f":"'SUB. 10'!F44","v":0},0,0,{"$f":"'SUB. 10'!G44","v":0},{"$f":"'SUB. 10'!H44","v":0},0,0,0,0]
[null,{"$f":"'SUB. 10'!B45:D45","v":0},{"$f":"'SUB. 10'!E45","v":0},{"$f":"'SUB. 10'!F45","v":0},0,0,{"$f":"'SUB. 10'!G45","v":0},{"$f":"'SUB. 10'!H45","v":0},0,0,0,0]
[null,{"$f":"'SUB. 10'!B46:D46","v":0},{"$f":"'SUB. 10'!E46","v":0},{"$f":"'SUB. 10'!F46","v":0},0,0,{"$f":"'SUB. 10'!G46","v":0},{"$f":"'SUB. 10'!H46","v":0},0,0,0,0]
[null,{"$f":"'SUB. 10'!B47:D47","v":0},{"$f":"'SUB. 10'!E47","v":0},{"$f":"'SUB. 10'!F47","v":0},0,0,{"$f":"'SUB. 10'!G47","v":0},{"$f":"'SUB. 10'!H47","v":0},0,0,0,0]
[null,{"$f":"'SUB. 10'!B48:D48","v":0},{"$f":"'SUB. 10'!E48","v":0},{"$f":"'SUB. 10'!F48","v":0},0,0,{"$f":"'SUB. 10'!G48","v":0},{"$f":"'SUB. 10'!H48","v":0},0,0,0,0]
[null,{"$f":"'SUB. 10'!B49:D49","v":0},{"$f":"'SUB. 10'!E49","v":0},{"$f":"'SUB. 10'!F49","v":0},0,0,{"$f":"'SUB. 10'!G49","v":0},{"$f":"'SUB. 10'!H49","v":0},0,0,0,0]
[null,{"$f":"'SUB. 10'!B50:D50","v":0},{"$f":"'SUB. 10'!E50","v":0},{"$f":"'SUB. 10'!F50","v":0},0,0,{"$f":"'SUB. 10'!G50","v":0},{"$f":"'SUB. 10'!H50","v":0},0,0,0,0]
[null,{"$f":"'SUB. 10'!B51:D51","v":0},{"$f":"'SUB. 10'!E51","v":0},{"$f":"'SUB. 10'!F51","v":0},0,0,{"$f":"'SUB. 10'!G51","v":0},{"$f":"'SUB. 10'!H51","v":0},0,0,0,0]
[null,{"$f":"'SUB. 10'!B52:D52","v":0},{"$f":"'SUB. 10'!E52","v":0},{"$f":"'SUB. 10'!F52","v":0},0,0,{"$f":"'SUB. 10'!G52","v":0},{"$f":"'SUB. 10'!H52","v":0},0,0,0,0]
[null,{"$f":"'SUB. 10'!B53:D53","v":0},{"$f":"'SUB. 10'!E53","v":0},{"$f":"'SUB. 10'!F53","v":0},0,0,{"$f":"'SUB. 10'!G53","v":0},{"$f":"'SUB. 10'!H53","v":0},0,0,0,0]
[null,{"$f":"'SUB. 10'!B54:D54","v":0},{"$f":"'SUB. 10'!E54","v":0},{"$f":"'SUB. 10'!F54","v":0},0,0,{"$f":"'SUB. 10'!G54","v":0},{"$f":"'SUB. 10'!H54","v":0},0,0,0,0]
[null,{"$f":"'SUB. 10'!B55:D55","v":0},{"$f":"'SUB. 10'!E55","v":0},{"$f":"'SUB. 10'!F55","v":0},0,0,{"$f":"'SUB. 10'!G55","v":0},{"$f":"'SUB. 10'!H55","v":0},0,0,0,0]
[null,{"$f":"'SUB. 10'!B56:D56","v":0},{"$f":"'SUB. 10'!E56","v":0},{"$f":"'SUB. 10'!F56","v":0},0,0,{"$f":"'SUB. 10'!G56","v":0},{"$f":"'SUB. 10'!H56","v":0},0,0,0,0]
["SUBSISTEMA 11",{"$f":"'SUB. 11'!B42:D42","v":0},{"$f":"'SUB. 11'!E42","v":0},{"$f":"'SUB. 11'!F42","v":0},0,0,{"$f":"'SUB. 11'!G42","v":0},{"$f":"'SUB. 11'!H42","v":0},0,0,0,0]
[null,{"$f":"'SUB. 11'!B43:D43","v":0},{"$f":"'SUB. 11'!E43","v":0},{"$f":"'SUB. 11'!F43","v":0},0,0,{"$f":"'SUB. 11'!G43","v":0},{"$f":"'SUB. 11'!H43","v":0},{"$f":"N389","v":0},{"$f":"N389","v":0},{"$f":"N389","v":0},0]
[null,{"$f":"'SUB. 11'!B44:D44","v":0},{"$f":"'SUB. 11'!E44","v":0},{"$f":"'SUB. 11'!F44","v":0},0,0,{"$f":"'SUB. 11'!G44","v":0},{"$f":"'SUB. 11'!H44","v":0},0,0,0,0]
[null,{"$f":"'SUB. 11'!B45:D45","v":0},{"$f":"'SUB. 11'!E45","v":0},{"$f":"'SUB. 11'!F45","v":0},0,0,{"$f":"'SUB. 11'!G45","v":0},{"$f":"'SUB. 11'!H45","v":0},0,0,0,{"$f":"N391","v":0}]
[null,{"$f":"'SUB. 11'!B46:D46","v":0},{"$f":"'SUB. 11'!E46","v":0},{"$f":"'SUB. 11'!F46","v":0},0,0,{"$f":"'SUB. 11'!G46","v":0},{"$f":"'SUB. 11'!H46","v":0},0,0,0,0]
[null,{"$f":"'SUB. 11'!B47:D47","v":0},{"$f":"'SUB. 11'!E47","v":0},{"$f":"'SUB. 11'!F47","v":0},0,0,{"$f":"'SUB. 11'!G47","v":0},{"$f":"'SUB. 11'!H47","v":0},0,0,0,0]
[null,{"$f":"'SUB. 11'!B48:D48","v":0},{"$f":"'SUB. 11'!E48","v":0},{"$f":"'SUB. 11'!F48","v":0},0,0,{"$f":"'SUB. 11'!G48","v":0},{"$f":"'SUB. 11'!H48","v":0},0,0,0,0]
[null,{"$f":"'SUB. 11'!B49:D49","v":0},{"$f":"'SUB. 11'!E49","v":0},{"$f":"'SUB. 11'!F49","v":0},0,0,{"$f":"'SUB. 11'!G49","v":0},{"$f":"'SUB. 11'!H49","v":0},0,0,0,0]
[null,{"$f":"'SUB. 11'!B50:D50","v":0},{"$f":"'SUB. 11'!E50","v":0},{"$f":"'SUB. 11'!F50","v":0},0,0,{"$f":"'SUB. 11'!G50","v":0},{"$f":"'SUB. 11'!H50","v":0},0,0,0,0]
[null,{"$f":"'SUB. 11'!B51:D51","v":0},{"$f":"'SUB. 11'!E51","v":0},{"$f":"'SUB. 11'!F51","v":0},0,0,{"$f":"'SUB. 11'!G51","v":0},{"$f":"'SUB. 11'!H51","v":0},0,0,0,0]
[null,{"$f":"'SUB. 11'!B52:D52","v":0},{"$f":"'SUB. 11'!E52","v":0},{"$f":"'SUB. 11'!F52","v":0},0,0,{"$f":"'SUB. 11'!G52","v":0},{"$f":"'SUB. 11'!H52","v":0},0,0,0,0]
[null,{"$f":"'SUB. 11'!B53:D53","v":0},{"$f":"'SUB. 11'!E53","v":0},{"$f":"'SUB. 11'!F53","v":0},0,0,{"$f":"'SUB. 11'!G53","v":0},{"$f":"'SUB. 11'!H53","v":0},0,0,0,0]
[null,{"$f":"'SUB. 11'!B54:D54","v":0},{"$f":"'SUB. 11'!E54","v":0},{"$f":"'SUB. 11'!F54","v":0},0,0,{"$f":"'SUB. 11'!G54","v":0},{"$f":"'SUB. 11'!H54","v":0},0,0,0,0]
[null,{"$f":"'SUB. 11'!B55:D55","v":0},{"$f":"'SUB. 11'!E55","v":0},{"$f":"'SUB. 11'!F55","v":0},0,0,{"$f":"'SUB. 11'!G55","v":0},{"$f":"'SUB. 11'!H55","v":0},0,0,0,0]
[null,{"$f":"'SUB. 11'!B56:D56","v":0},{"$f":"'SUB. 11'!E56","v":0},{"$f":"'SUB. 11'!F56","v":0},0,0,{"$f":"'SUB. 11'!G56","v":0},{"$f":"'SUB. 11'!H56","v":0},0,0,0,0]
["SUBSISTEMA 12",{"$f":"'SUB. 12'!B42:D42","v":0},{"$f":"'SUB. 12'!E42","v":0},{"$f":"'SUB. 12'!F42","v":0},0,0,{"$f":"'SUB. 12'!G42","v":0},{"$f":"'SUB. 12'!H42","v":0},0,0,0,0]
[null,{"$f":"'SUB. 12'!B43:D43","v":0},{"$f":"'SUB. 12'!E43","v":0},{"$f":"'SUB. 12'!F43","v":0},0,0,{"$f":"'SUB. 12'!G43","v":0},{"$f":"'SUB. 12'!H43","v":0},0,0,0,0]
[null,{"$f":"'SUB. 12'!B44:D44","v":0},{"$f":"'SUB. 12'!E44","v":0},{"$f":"'SUB. 12'!F44","v":0},0,0,{"$f":"'SUB. 12'!G44","v":0},{"$f":"'SUB. 12'!H44","v":0},0,0,0,0]
[null,{"$f":"'SUB. 12'!B45:D45","v":0},{"$f":"'SUB. 12'!E45","v":0},{"$f":"'SUB. 12'!F45","v":0},0,0,{"$f":"'SUB. 12'!G45","v":0},{"$f":"'SUB. 12'!H45","v":0},0,0,0,0]
[null,{"$f":"'SUB. 12'!B46:D46","v":0},{"$f":"'SUB. 12'!E46","v":0},{"$f":"'SUB. 12'!F46","v":0},0,0,{"$f":"'SUB. 12'!G46","v":0},{"$f":"'SUB. 12'!H46","v":0},0,0,0,0]
[null,{"$f":"'SUB. 12'!B47:D47","v":0},{"$f":"'SUB. 12'!E47","v":0},{"$f":"'SUB. 12'!F47","v":0},0,0,{"$f":"'SUB. 12'!G47","v":0},{"$f":"'SUB. 12'!H47","v":0},0,0,0,0]
[null,{"$f":"'SUB. 12'!B48:D48","v":0},{"$f":"'SUB. 12'!E48","v":0},{"$f":"'SUB. 12'!F48","v":0},0,0,{"$f":"'SUB. 12'!G48","v":0},{"$f":"'SUB. 12'!H48","v":0},0,0,0,0]
[null,{"$f":"'SUB. 12'!B49:D49","v":0},{"$f":"'SUB. 12'!E49","v":0},{"$f":"'SUB. 12'!F49","v":0},0,0,{"$f":"'SUB. 12'!G49","v":0},{"$f":"'SUB. 12'!H49","v":0},{"$f":"N410","v":0},0,0,0]
[null,{"$f":"'SUB. 12'!B50:D50","v":0},{"$f":"'SUB. 12'!E50","v":0},{"$f":"'SUB. 12'!F50","v":0},0,0,{"$f":"'SUB. 12'!G50","v":0},{"$f":"'SUB. 12'!H50","v":0},{"$f":"N411","v":0},0,0,0]
[null,{"$f":"'SUB. 12'!B51:D51","v":0},{"$f":"'SUB. 12'!E51","v":0},{"$f":"'SUB. 12'!F51","v":0},0,0,{"$f":"'SUB. 12'!G51","v":0},{"$f":"'SUB. 12'!H51","v":0},0,0,0,0]
[null,{"$f":"'SUB. 12'!B52:D52","v":0},{"$f":"'SUB. 12'!E52","v":0},{"$f":"'SUB. 12'!F52","v":0},0,0,{"$f":"'SUB. 12'!G52","v":0},{"$f":"'SUB. 12'!H52","v":0},0,0,0,0]
[null,{"$f":"'SUB. 12'!B53:D53","v":0},{"$f":"'SUB. 12'!E53","v":0},{"$f":"'SUB. 12'!F53","v":0},0,0,{"$f":"'SUB. 12'!G53","v":0},{"$f":"'SUB. 12'!H53","v":0},0,0,0,0]
[null,{"$f":"'SUB. 12'!B54:D54","v":0},{"$f":"'SUB. 12'!E54","v":0},{"$f":"'SUB. 12'!F54","v":0},0,0,{"$f":"'SUB. 12'!G54","v":0},{"$f":"'SUB. 12'!H54","v":0},0,0,0,0]
[null,{"$f":"'SUB. 12'!B55:D55","v":0},{"$f":"'SUB. 12'!E55","v":0},{"$f":"'SUB. 12'!F55","v":0},0,0,{"$f":"'SUB. 12'!G55","v":0},{"$f":"'SUB. 12'!H55","v":0},0,0,0,0]
[null,{"$f":"'SUB. 12'!B56:D56","v":0},{"$f":"'SUB. 12'!E56","v":0},{"$f":"'SUB. 12'!F56","v":0},0,0,{"$f":"'SUB. 12'!G56","v":0},{"$f":"'SUB. 12'!H56","v":0},0,0,0,0]
["SUBSISTEMA 13",{"$f":"'SUB. Extrativista'!B42:D42","v":0},{"$f":"'SUB. Extrativista'!E42","v":0},{"$f":"'SUB. Extrativista'!F42","v":0},0,0,{"$f":"'SUB. Extrativista'!G42","v":0},{"$f":"'SUB. Extrativista'!H42","v":0},0,0,0,0]
[null,{"$f":"'SUB. Extrativista'!B43:D43","v":0},{"$f":"'SUB. Extrativista'!E43","v":0},{"$f":"'SUB. Extrativista'!F43","v":0},0,0,{"$f":"'SUB. Extrativista'!G43","v":0},{"$f":"'SUB. Extrativista'!H43","v":0},0,0,0,0]
[null,{"$f":"'SUB. Extrativista'!B44:D44","v":0},{"$f":"'SUB. Extrativista'!E44","v":0},{"$f":"'SUB. Extrativista'!F44","v":0},0,0,{"$f":"'SUB. Extrativista'!G44","v":0},{"$f":"'SUB. Extrativista'!H44","v":0},0,0,0,0]
[null,{"$f":"'SUB. Extrativista'!B45:D45","v":0},{"$f":"'SUB. Extrativista'!E45","v":0},{"$f":"'SUB. Extrativista'!F45","v":0},0,0,{"$f":"'SUB. Extrativista'!G45","v":0},{"$f":"'SUB. Extrativista'!H45","v":0},0,0,0,0]
[null,{"$f":"'SUB. Extrativista'!B46:D46","v":0},{"$f":"'SUB. Extrativista'!E46","v":0},{"$f":"'SUB. Extrativista'!F46","v":0},0,0,{"$f":"'SUB. Extrativista'!G46","v":0},{"$f":"'SUB. Extrativista'!H46","v":0},0,0,0,0]
[null,{"$f":"'SUB. Extrativista'!B47:D47","v":0},{"$f":"'SUB. Extrativista'!E47","v":0},{"$f":"'SUB. Extrativista'!F47","v":0},0,0,{"$f":"'SUB. Extrativista'!G47","v":0},{"$f":"'SUB. Extrativista'!H47","v":0},0,0,0,0]
[null,{"$f":"'SUB. Extrativista'!B48:D48","v":0},{"$f":"'SUB. Extrativista'!E48","v":0},{"$f":"'SUB. Extrativista'!F48","v":0},0,0,{"$f":"'SUB. Extrativista'!G48","v":0},{"$f":"'SUB. Extrativista'!H48","v":0},0,0,0,0]
[null,{"$f":"'SUB. Extrativista'!B49:D49","v":0},{"$f":"'SUB. Extrativista'!E49","v":0},{"$f":"'SUB. Extrativista'!F49","v":0},0,0,{"$f":"'SUB. Extrativista'!G49","v":0},{"$f":"'SUB. Extrativista'!H49","v":0},0,0,0,0]
[null,{"$f":"'SUB. Extrativista'!B50:D50","v":0},{"$f":"'SUB. Extrativista'!E50","v":0},{"$f":"'SUB. Extrativista'!F50","v":0},0,0,{"$f":"'SUB. Extrativista'!G50","v":0},{"$f":"'SUB. Extrativista'!H50","v":0},0,0,0,0]
[null,{"$f":"'SUB. Extrativista'!B51:D51","v":0},{"$f":"'SUB. Extrativista'!E51","v":0},{"$f":"'SUB. Extrativista'!F51","v":0},0,0,{"$f":"'SUB. Extrativista'!G51","v":0},{"$f":"'SUB. Extrativista'!H51","v":0},0,0,0,0]
[null,{"$f":"'SUB. Extrativista'!B52:D52","v":0},{"$f":"'SUB. Extrativista'!E52","v":0},{"$f":"'SUB. Extrativista'!F52","v":0},0,0,{"$f":"'SUB. Extrativista'!G52","v":0},{"$f":"'SUB. Extrativista'!H52","v":0},0,0,0,0]
[null,{"$f":"'SUB. Extrativista'!B53:D53","v":0},{"$f":"'SUB. Extrativista'!E53","v":0},{"$f":"'SUB. Extrativista'!F53","v":0},0,0,{"$f":"'SUB. Extrativista'!G53","v":0},{"$f":"'SUB. Extrativista'!H53","v":0},{"$f":"N429","v":0},0,0,0]
[null,{"$f":"'SUB. Extrativista'!B54:D54","v":0},{"$f":"'SUB. Extrativista'!E54","v":0},{"$f":"'SUB. Extrativista'!F54","v":0},0,0,{"$f":"'SUB. Extrativista'!G54","v":0},{"$f":"'SUB. Extrativista'!H54","v":0},{"$f":"N430","v":0},0,0,0]
[null,{"$f":"'SUB. Extrativista'!B55:D55","v":0},{"$f":"'SUB. Extrativista'!E55","v":0},{"$f":"'SUB. Extrativista'!F55","v":0},0,{"$f":"N431","v":0},{"$f":"'SUB. Extrativista'!G55","v":0},{"$f":"'SUB. Extrativista'!H55","v":0},{"$f":"N431","v":0},0,0,0]
[null,{"$f":"'SUB. Extrativista'!B56:D56","v":0},{"$f":"'SUB. Extrativista'!E56","v":0},{"$f":"'SUB. Extrativista'!F56","v":0},{"$f":"N432","v":0},{"$f":"N432","v":0},{"$f":"'SUB. Extrativista'!G56","v":0},{"$f":"'SUB. Extrativista'!H56","v":0},{"$f":"N432","v":0},0,0,0]
["AGROECOSSITEMA",{"$f":"Agroecossistema!B127","v":"silagem"},{"$f":"Agroecossistema!D127","v":"ton"},{"$f":"Agroecossistema!E127","v":300},{"$f":"N433","v":0},{"$f":"N433","v":0},{"$f":"N433","v":0},{"$f":"N433","v":0},{"$f":"Agroecossistema!F127","v":10},{"$f":"Agroecossistema!G127","v":3000},{"$f":"Agroecossistema!H127","v":6},{"$f":"Agroecossistema!I127","v":1800}]
[null,{"$f":"Agroecossistema!B128","v":0},{"$f":"Agroecossistema!D128","v":0},{"$f":"Agroecossistema!E128","v":0},{"$f":"N434","v":0},{"$f":"N434","v":0},{"$f":"N434","v":0},{"$f":"N434","v":0},{"$f":"Agroecossistema!F128","v":0},{"$f":"Agroecossistema!G128","v":0},{"$f":"Agroecossistema!H128","v":0},{"$f":"Agroecossistema!I128","v":0}]
[null,{"$f":"Agroecossistema!B129","v":0},{"$f":"Agroecossistema!D129","v":0},{"$f":"Agroecossistema!E129","v":0},0,0,0,0,{"$f":"Agroecossistema!F129","v":0},{"$f":"Agroecossistema!G129","v":0},{"$f":"Agroecossistema!H129","v":0},{"$f":"Agroecossistema!I129","v":0}]
[null,{"$f":"Agroecossistema!B130","v":0},{"$f":"Agroecossistema!D130","v":0},{"$f":"Agroecossistema!E130","v":0},0,0,0,0,{"$f":"Agroecossistema!F130","v":0},{"$f":"Agroecossistema!G130","v":0},{"$f":"Agroecossistema!H130","v":0},{"$f":"Agroecossistema!I130","v":0}]
[null,{"$f":"Agroecossistema!B131","v":0},{"$f":"Agroecossistema!D131","v":0},{"$f":"Agroecossistema!E131","v":0},0,0,0,0,{"$f":"Agroecossistema!F131","v":0},{"$f":"Agroecossistema!G131","v":0},{"$f":"Agroecossistema!H131","v":0},{"$f":"Agroecossistema!I131","v":0}]
[null,{"$f":"Agroecossistema!B132","v":0},{"$f":"Agroecossistema!D132","v":0},{"$f":"Agroecossistema!E132","v":0},0,0,0,0,{"$f":"Agroecossistema!F132","v":0},{"$f":"Agroecossistema!G132","v":0},{"$f":"Agroecossistema!H132","v":0},{"$f":"Agroecossistema!I132","v":0}]
[null,{"$f":"Agroecossistema!B133","v":0},{"$f":"Agroecossistema!D133","v":0},{"$f":"Agroecossistema!E133","v":0},0,0,0,0,{"$f":"Agroecossistema!F133","v":0},{"$f":"Agroecossistema!G133","v":0},{"$f":"Agroecossistema!H133","v":0},{"$f":"Agroecossistema!I133","v":0}]
[null,{"$f":"Agroecossistema!B134","v":0},{"$f":"Agroecossistema!D134","v":0},{"$f":"Agroecossistema!E134","v":0},0,0,0,0,{"$f":"Agroecossistema!F134","v":0},{"$f":"Agroecossistema!G134","v":0},{"$f":"Agroecossistema!H134","v":0},{"$f":"Agroecossistema!I134","v":0}]
[null,{"$f":"Agroecossistema!B135","v":0},{"$f":"Agroecossistema!D135","v":0},{"$f":"Agroecossistema!E135","v":0},0,0,0,0,{"$f":"Agroecossistema!F135","v":0},{"$f":"Agroecossistema!G135","v":0},{"$f":"Agroecossistema!H135","v":0},{"$f":"Agroecossistema!I135","v":0}]
[null,{"$f":"Agroecossistema!B136","v":0},{"$f":"Agroecossistema!D136","v":0},{"$f":"Agroecossistema!E136","v":0},0,0,0,0,{"$f":"Agroecossistema!F136","v":0},{"$f":"Agroecossistema!G136","v":0},{"$f":"Agroecossistema!H136","v":0},{"$f":"Agroecossistema!I136","v":0}]
[null,{"$f":"Agroecossistema!B137","v":0},{"$f":"Agroecossistema!D137","v":0},{"$f":"Agroecossistema!E137","v":0},0,0,0,0,{"$f":"Agroecossistema!F137","v":0},{"$f":"Agroecossistema!G137","v":0},{"$f":"Agroecossistema!H137","v":0},{"$f":"Agroecossistema!I137","v":0}]
[null,{"$f":"Agroecossistema!B138","v":0},{"$f":"Agroecossistema!D138","v":0},{"$f":"Agroecossistema!E138","v":0},0,0,0,0,{"$f":"Agroecossistema!F138","v":0},{"$f":"Agroecossistema!G138","v":0},{"$f":"Agroecossistema!H138","v":0},{"$f":"Agroecossistema!I138","v":0}]
[null,{"$f":"Agroecossistema!B139","v":0},{"$f":"Agroecossistema!D139","v":0},{"$f":"Agroecossistema!E139","v":0},0,0,0,0,{"$f":"Agroecossistema!F139","v":0},{"$f":"Agroecossistema!G139","v":0},{"$f":"Agroecossistema!H139","v":0},{"$f":"Agroecossistema!I139","v":0}]
[null,{"$f":"Agroecossistema!B140","v":0},{"$f":"Agroecossistema!D140","v":0},{"$f":"Agroecossistema!E140","v":0},0,0,0,0,{"$f":"Agroecossistema!F140","v":0},{"$f":"Agroecossistema!G140","v":0},{"$f":"Agroecossistema!H140","v":0},{"$f":"Agroecossistema!I140","v":0}]
[null,{"$f":"Agroecossistema!B141","v":0},{"$f":"Agroecossistema!D141","v":0},{"$f":"Agroecossistema!E141","v":0},0,0,0,0,{"$f":"Agroecossistema!F141","v":0},{"$f":"Agroecossistema!G141","v":0},{"$f":"Agroecossistema!H141","v":0},{"$f":"Agroecossistema!I141","v":0}]
[null,{"$f":"Agroecossistema!B142","v":0},{"$f":"Agroecossistema!D142","v":0},{"$f":"Agroecossistema!E142","v":0},0,0,0,0,{"$f":"Agroecossistema!F142","v":0},{"$f":"Agroecossistema!G142","v":0},{"$f":"Agroecossistema!H142","v":0},{"$f":"Agroecossistema!I142","v":0}]
[null,{"$f":"Agroecossistema!B143","v":0},{"$f":"Agroecossistema!D143","v":0},{"$f":"Agroecossistema!E143","v":0},0,0,0,0,{"$f":"Agroecossistema!F143","v":0},{"$f":"Agroecossistema!G143","v":0},{"$f":"Agroecossistema!H143","v":0},{"$f":"Agroecossistema!I143","v":0}]
[null,{"$f":"Agroecossistema!B144","v":0},{"$f":"Agroecossistema!D144","v":0},{"$f":"Agroecossistema!E144","v":0},0,0,0,0,{"$f":"Agroecossistema!F144","v":0},{"$f":"Agroecossistema!G144","v":0},{"$f":"Agroecossistema!H144","v":0},{"$f":"Agroecossistema!I144","v":0}]
[null,{"$f":"Agroecossistema!B145","v":0},{"$f":"Agroecossistema!D145","v":0},{"$f":"Agroecossistema!E145","v":0},0,0,0,0,{"$f":"Agroecossistema!F145","v":0},{"$f":"Agroecossistema!G145","v":0},{"$f":"Agroecossistema!H145","v":0},{"$f":"Agroecossistema!I145","v":0}]
[null,{"$f":"Agroecossistema!B146","v":0},{"$f":"Agroecossistema!D146","v":0},{"$f":"Agroecossistema!E146","v":0},0,0,0,0,{"$f":"Agroecossistema!F146","v":0},{"$f":"Agroecossistema!G146","v":0},{"$f":"Agroecossistema!H146","v":0},{"$f":"Agroecossistema!I146","v":0}]
[null,{"$f":"Agroecossistema!B147","v":0},{"$f":"Agroecossistema!D147","v":0},{"$f":"Agroecossistema!E147","v":0},0,0,0,0,{"$f":"Agroecossistema!F147","v":0},{"$f":"Agroecossistema!G147","v":0},{"$f":"Agroecossistema!H147","v":0},{"$f":"Agroecossistema!I147","v":0}]
[null,{"$f":"Agroecossistema!B148","v":0},{"$f":"Agroecossistema!D148","v":0},{"$f":"Agroecossistema!E148","v":0},0,0,0,0,{"$f":"Agroecossistema!F148","v":0},{"$f":"Agroecossistema!G148","v":0},{"$f":"Agroecossistema!H148","v":0},{"$f":"Agroecossistema!I148","v":0}]
[null,{"$f":"Agroecossistema!B149","v":0},{"$f":"Agroecossistema!D149","v":0},{"$f":"Agroecossistema!E149","v":0},0,0,0,0,{"$f":"Agroecossistema!F149","v":0},{"$f":"Agroecossistema!G149","v":0},{"$f":"Agroecossistema!H149","v":0},{"$f":"Agroecossistema!I149","v":0}]
[null,{"$f":"Agroecossistema!B150","v":0},{"$f":"Agroecossistema!D150","v":0},{"$f":"Agroecossistema!E150","v":0},0,0,0,0,{"$f":"Agroecossistema!F150","v":0},{"$f":"Agroecossistema!G150","v":0},{"$f":"Agroecossistema!H150","v":0},{"$f":"Agroecossistema!I150","v":0}]
[null,{"$f":"Agroecossistema!B151","v":0},{"$f":"Agroecossistema!D151","v":0},{"$f":"Agroecossistema!E151","v":0},0,0,null,0,{"$f":"Agroecossistema!F151","v":0},{"$f":"Agroecossistema!G151","v":0},{"$f":"Agroecossistema!H151","v":0},{"$f":"Agroecossistema!I151","v":0}]

{"sheet":"TD Insumos","index":36,"n_rows":73,"n_cols":13,"rows_kept":73,"cut":false,"hidden":true,"merged":[[61,0,61,1],[60,0,60,1],[59,0,59,1],[49,12,49,13],[40,0,40,1],[50,12,50,13],[46,0,46,1],[46,12,46,13],[42,12,42,13],[43,12,43,13],[44,12,44,13],[53,12,53,13],[53,0,53,1],[50,0,50,1],[55,0,55,1],[51,12,51,13],[39,12,39,13],[41,0,41,1],[42,0,42,1],[41,12,41,13],[40,12,40,13],[31,0,31,1],[47,12,47,13],[49,0,49,1],[43,0,43,1],[35,0,35,1],[36,12,36,13],[37,0,37,1],[37,12,37,13],[39,0,39,1],[47,0,47,1],[33,12,33,13],[35,12,35,13],[36,0,36,1],[38,0,38,1],[44,0,44,1],[33,0,33,1],[51,0,51,1],[52,0,52,1],[45,0,45,1],[54,0,54,1],[48,0,48,1],[56,0,56,1],[57,0,57,1],[58,0,58,1],[30,12,30,13],[31,12,31,13],[32,0,32,1],[38,12,38,13],[34,0,34,1],[34,12,34,13],[30,0,30,3],[30,4,30,5],[32,12,32,13],[30,10,30,11],[30,6,30,7],[30,8,30,9],[55,12,55,13],[72,0,72,1],[45,12,45,13],[48,12,48,13],[60,12,60,13],[62,12,62,13],[63,12,63,13],[64,12,64,13],[58,12,58,13],[59,12,59,13],[71,0,71,1],[71,12,71,13],[65,12,65,13],[66,12,66,13],[67,12,67,13],[68,12,68,13],[72,12,72,13],[70,12,70,13],[69,12,69,13],[66,0,66,1],[52,12,52,13],[61,12,61,13],[62,0,62,1],[63,0,63,1],[64,0,64,1],[57,12,57,13],[65,0,65,1],[54,12,54,13],[56,12,56,13],[67,0,67,1],[68,0,68,1],[69,0,69,1],[70,0,70,1]]}
[]
[]
[null,null,null,"Dados"]
["Produtos","Unidade","Valor Unitário","Soma de Quantidade3","Soma de Estoque período anterior","Soma de Quantidade","Soma de Produzido","Soma de Quantidade2","Soma de Consumidos"]
[0,null,null,0,0,0,0,0,0]
["","",null,0,0,0,0,null,0]
["esterco","kg",0.4,0,0,180,72,null,0]
[null,null,2,0,0,1680,3360,null,0]
[null,null,0.42,0,0,365,153.29999999999998,60,25.2]
["esterco ","kg",0.42,0,0,1500,630,null,0]
["silagem","ton",300,10,3000,0,0,10,3000]
["palha","kg",0.4,0,0,0,0,1800,720]
["Palma","kg",1,0,0,0,0,1825,1825]
[null,null,0.2,0,0,20100,4020,20100,4020]
["palha de milho","kg",0.4,0,0,0,0,45,18]
["ração milho","kg",1,0,0,0,0,300,300]
["silo","kg",0.3,0,0,0,0,365,109.5]
["gliricidea","kg",3,0,0,183,549,null,0]
["esterco galinha","kg",0.42,0,0,0,0,75,31.5]
["esterco ovnos","kg",0.42,0,0,0,0,75,31.5]
[]
[]
[]
[]
[]
[]
[]
[]
[]
[]
["ECONOMIA DE RECIPROCIDADE - Ecológica",null,null,null,"Estocado no periodo anterior",null,"Insumos proprios produzidos",null,"Insumos próprios consumidos",null,"Estoque final do periodo",null,"Observações"]
["Insumos",null,"Unidade","Valor Unitário","Qtde","Valor Total 1","Qtde","Valor Total 2","Qtde","Valor Total 3","Qtde","Valor Total 4"]
[{"$f":"'TD Insumos'!A7","v":"esterco"},null,{"$f":"'TD Insumos'!B7","v":"kg"},{"$f":"'TD Insumos'!C7","v":0.4},{"$f":"'TD Insumos'!D7","v":0},{"$f":"'TD Insumos'!E7","v":0},{"$f":"'TD Insumos'!F7","v":180},{"$f":"'TD Insumos'!G7","v":72},{"$f":"'TD Insumos'!H7","v":0},{"$f":"'TD Insumos'!I7","v":0},{"$f":"E33+G33-I33","v":180},{"$f":"D33+H33-J33","v":72.400000000000006}]
[{"$f":"'TD Insumos'!A8","v":0},null,{"$f":"'TD Insumos'!B8","v":0},{"$f":"'TD Insumos'!C8","v":2},{"$f":"'TD Insumos'!D8","v":0},{"$f":"'TD Insumos'!E8","v":0},{"$f":"'TD Insumos'!F8","v":1680},{"$f":"'TD Insumos'!G8","v":3360},{"$f":"'TD Insumos'!H8","v":0},{"$f":"'TD Insumos'!I8","v":0},1680,3362]
[{"$f":"'TD Insumos'!A9","v":0},null,{"$f":"'TD Insumos'!B9","v":0},{"$f":"'TD Insumos'!C9","v":0.42},{"$f":"'TD Insumos'!D9","v":0},{"$f":"'TD Insumos'!E9","v":0},{"$f":"'TD Insumos'!F9","v":365},{"$f":"'TD Insumos'!G9","v":153.29999999999998},{"$f":"'TD Insumos'!H9","v":60},{"$f":"'TD Insumos'!I9","v":25.2},305,128.51999999999998]
[{"$f":"'TD Insumos'!A10","v":"esterco "},null,{"$f":"'TD Insumos'!B10","v":"kg"},{"$f":"'TD Insumos'!C10","v":0.42},{"$f":"'TD Insumos'!D10","v":0},{"$f":"'TD Insumos'!E10","v":0},{"$f":"'TD Insumos'!F10","v":1500},{"$f":"'TD Insumos'!G10","v":630},{"$f":"'TD Insumos'!H10","v":0},{"$f":"'TD Insumos'!I10","v":0},1500,630.41999999999996]
[{"$f":"'TD Insumos'!A11","v":"silagem"},null,{"$f":"'TD Insumos'!B11","v":"ton"},{"$f":"'TD Insumos'!C11","v":300},{"$f":"'TD Insumos'!D11","v":10},{"$f":"'TD Insumos'!E11","v":3000},{"$f":"'TD Insumos'!F11","v":0},{"$f":"'TD Insumos'!G11","v":0},{"$f":"'TD Insumos'!H11","v":10},{"$f":"'TD Insumos'!I11","v":3000},0,-2700]
[{"$f":"'TD Insumos'!A12","v":"palha"},null,{"$f":"'TD Insumos'!B12","v":"kg"},{"$f":"'TD Insumos'!C12","v":0.4},{"$f":"'TD Insumos'!D12","v":0},{"$f":"'TD Insumos'!E12","v":0},{"$f":"'TD Insumos'!F12","v":0},{"$f":"'TD Insumos'!G12","v":0},{"$f":"'TD Insumos'!H12","v":1800},{"$f":"'TD Insumos'!I12","v":720},-1800,-719.6]
[{"$f":"'TD Insumos'!A13","v":"Palma"},null,{"$f":"'TD Insumos'!B13","v":"kg"},{"$f":"'TD Insumos'!C13","v":1},{"$f":"'TD Insumos'!D13","v":0},{"$f":"'TD Insumos'!E13","v":0},{"$f":"'TD Insumos'!F13","v":0},{"$f":"'TD Insumos'!G13","v":0},{"$f":"'TD Insumos'!H13","v":1825},{"$f":"'TD Insumos'!I13","v":1825},-1825,-1824]
[{"$f":"'TD Insumos'!A14","v":0},null,{"$f":"'TD Insumos'!B14","v":0},{"$f":"'TD Insumos'!C14","v":0.2},{"$f":"'TD Insumos'!D14","v":0},{"$f":"'TD Insumos'!E14","v":0},{"$f":"'TD Insumos'!F14","v":20100},{"$f":"'TD Insumos'!G14","v":4020},{"$f":"'TD Insumos'!H14","v":20100},{"$f":"'TD Insumos'!I14","v":4020},0,0.1999999999998181]
[{"$f":"'TD Insumos'!A15","v":"palha de milho"},null,{"$f":"'TD Insumos'!B15","v":"kg"},{"$f":"'TD Insumos'!C15","v":0.4},{"$f":"'TD Insumos'!D15","v":0},{"$f":"'TD Insumos'!E15","v":0},{"$f":"'TD Insumos'!F15","v":0},{"$f":"'TD Insumos'!G15","v":0},{"$f":"'TD Insumos'!H15","v":45},{"$f":"'TD Insumos'!I15","v":18},-45,-17.600000000000001]
[{"$f":"'TD Insumos'!A16","v":"ração milho"},null,{"$f":"'TD Insumos'!B16","v":"kg"},{"$f":"'TD Insumos'!C16","v":1},{"$f":"'TD Insumos'!D16","v":0},{"$f":"'TD Insumos'!E16","v":0},{"$f":"'TD Insumos'!F16","v":0},{"$f":"'TD Insumos'!G16","v":0},{"$f":"'TD Insumos'!H16","v":300},{"$f":"'TD Insumos'!I16","v":300},-300,-299]
[{"$f":"'TD Insumos'!A17","v":"silo"},null,{"$f":"'TD Insumos'!B17","v":"kg"},{"$f":"'TD Insumos'!C17","v":0.3},{"$f":"'TD Insumos'!D17","v":0},{"$f":"'TD Insumos'!E17","v":0},{"$f":"'TD Insumos'!F17","v":0},{"$f":"'TD Insumos'!G17","v":0},{"$f":"'TD Insumos'!H17","v":365},{"$f":"'TD Insumos'!I17","v":109.5},-365,-109.2]
[{"$f":"'TD Insumos'!A18","v":"gliricidea"},null,{"$f":"'TD Insumos'!B18","v":"kg"},{"$f":"'TD Insumos'!C18","v":3},{"$f":"'TD Insumos'!D18","v":0},{"$f":"'TD Insumos'!E18","v":0},{"$f":"'TD Insumos'!F18","v":183},{"$f":"'TD Insumos'!G18","v":549},{"$f":"'TD Insumos'!H18","v":0},{"$f":"'TD Insumos'!I18","v":0},183,552]
[{"$f":"'TD Insumos'!A19","v":"esterco galinha"},null,{"$f":"'TD Insumos'!B19","v":"kg"},{"$f":"'TD Insumos'!C19","v":0.42},{"$f":"'TD Insumos'!D19","v":0},{"$f":"'TD Insumos'!E19","v":0},{"$f":"'TD Insumos'!F19","v":0},{"$f":"'TD Insumos'!G19","v":0},{"$f":"'TD Insumos'!H19","v":75},{"$f":"'TD Insumos'!I19","v":31.5},-75,-31.08]
[{"$f":"'TD Insumos'!A20","v":"esterco ovnos"},null,{"$f":"'TD Insumos'!B20","v":"kg"},{"$f":"'TD Insumos'!C20","v":0.42},{"$f":"'TD Insumos'!D20","v":0},{"$f":"'TD Insumos'!E20","v":0},{"$f":"'TD Insumos'!F20","v":0},{"$f":"'TD Insumos'!G20","v":0},{"$f":"'TD Insumos'!H20","v":75},{"$f":"'TD Insumos'!I20","v":31.5},-75,-31.08]
[{"$f":"'TD Insumos'!A21","v":0},null,{"$f":"'TD Insumos'!B21","v":0},{"$f":"'TD Insumos'!C21","v":0},{"$f":"'TD Insumos'!D21","v":0},{"$f":"'TD Insumos'!E21","v":0},{"$f":"'TD Insumos'!F21","v":0},{"$f":"'TD Insumos'!G21","v":0},{"$f":"'TD Insumos'!H21","v":0},{"$f":"'TD Insumos'!I21","v":0},0,0]
[{"$f":"'TD Insumos'!A22","v":0},null,{"$f":"'TD Insumos'!B22","v":0},{"$f":"'TD Insumos'!C22","v":0},{"$f":"'TD Insumos'!D22","v":0},{"$f":"'TD Insumos'!E22","v":0},{"$f":"'TD Insumos'!F22","v":0},{"$f":"'TD Insumos'!G22","v":0},{"$f":"'TD Insumos'!H22","v":0},{"$f":"'TD Insumos'!I22","v":0},0,0]
[{"$f":"'TD Insumos'!A23","v":0},null,{"$f":"'TD Insumos'!B23","v":0},{"$f":"'TD Insumos'!C23","v":0},{"$f":"'TD Insumos'!D23","v":0},{"$f":"'TD Insumos'!E23","v":0},{"$f":"'TD Insumos'!F23","v":0},{"$f":"'TD Insumos'!G23","v":0},{"$f":"'TD Insumos'!H23","v":0},{"$f":"'TD Insumos'!I23","v":0},0,0]
[{"$f":"'TD Insumos'!A24","v":0},null,{"$f":"'TD Insumos'!B24","v":0},{"$f":"'TD Insumos'!C24","v":0},{"$f":"'TD Insumos'!D24","v":0},{"$f":"'TD Insumos'!E24","v":0},{"$f":"'TD Insumos'!F24","v":0},{"$f":"'TD Insumos'!G24","v":0},{"$f":"'TD Insumos'!H24","v":0},{"$f":"'TD Insumos'!I24","v":0},0,0]
[{"$f":"'TD Insumos'!A25","v":0},null,{"$f":"'TD Insumos'!B25","v":0},{"$f":"'TD Insumos'!C25","v":0},{"$f":"'TD Insumos'!D25","v":0},{"$f":"'TD Insumos'!E25","v":0},{"$f":"'TD Insumos'!F25","v":0},{"$f":"'TD Insumos'!G25","v":0},{"$f":"'TD Insumos'!H25","v":0},{"$f":"'TD Insumos'!I25","v":0},0,0]
[{"$f":"'TD Insumos'!A26","v":0},null,{"$f":"'TD Insumos'!B26","v":0},{"$f":"'TD Insumos'!C26","v":0},{"$f":"'TD Insumos'!D26","v":0},{"$f":"'TD Insumos'!E26","v":0},{"$f":"'TD Insumos'!F26","v":0},{"$f":"'TD Insumos'!G26","v":0},{"$f":"'TD Insumos'!H26","v":0},{"$f":"'TD Insumos'!I26","v":0},0,0]
[{"$f":"'TD Insumos'!A27","v":0},null,{"$f":"'TD Insumos'!B27","v":0},{"$f":"'TD Insumos'!C27","v":0},{"$f":"'TD Insumos'!D27","v":0},{"$f":"'TD Insumos'!E27","v":0},{"$f":"'TD Insumos'!F27","v":0},{"$f":"'TD Insumos'!G27","v":0},{"$f":"'TD Insumos'!H27","v":0},{"$f":"'TD Insumos'!I27","v":0},0,0]
[{"$f":"'TD Insumos'!A28","v":0},null,{"$f":"'TD Insumos'!B28","v":0},{"$f":"'TD Insumos'!C28","v":0},{"$f":"'TD Insumos'!D28","v":0},{"$f":"'TD Insumos'!E28","v":0},{"$f":"'TD Insumos'!F28","v":0},{"$f":"'TD Insumos'!G28","v":0},{"$f":"'TD Insumos'!H28","v":0},{"$f":"'TD Insumos'!I28","v":0},0,0]
[{"$f":"'TD Insumos'!A29","v":0},null,{"$f":"'TD Insumos'!B29","v":0},{"$f":"'TD Insumos'!C29","v":0},{"$f":"'TD Insumos'!D29","v":0},{"$f":"'TD Insumos'!E29","v":0},{"$f":"'TD Insumos'!F29","v":0},{"$f":"'TD Insumos'!G29","v":0},{"$f":"'TD Insumos'!H29","v":0},{"$f":"'TD Insumos'!I29","v":0},0,0]
[{"$f":"'TD Insumos'!A30","v":0},null,{"$f":"'TD Insumos'!B30","v":0},{"$f":"'TD Insumos'!C30","v":0},{"$f":"'TD Insumos'!D30","v":0},{"$f":"'TD Insumos'!E30","v":0},{"$f":"'TD Insumos'!F30","v":0},{"$f":"'TD Insumos'!G30","v":0},{"$f":"'TD Insumos'!H30","v":0},{"$f":"'TD Insumos'!I30","v":0},0,0]
[{"$f":"'TD Insumos'!#REF!","v":{"$error":"#REF!"}},null,{"$f":"'TD Insumos'!#REF!","v":{"$error":"#REF!"}},{"$f":"'TD Insumos'!#REF!","v":{"$error":"#REF!"}},{"$f":"'TD Insumos'!#REF!","v":{"$error":"#REF!"}},{"$f":"'TD Insumos'!#REF!","v":{"$error":"#REF!"}},{"$f":"'TD Insumos'!#REF!","v":{"$error":"#REF!"}},{"$f":"'TD Insumos'!#REF!","v":{"$error":"#REF!"}},{"$f":"'TD Insumos'!#REF!","v":{"$error":"#REF!"}},{"$f":"'TD Insumos'!#REF!","v":{"$error":"#REF!"}},{"$error":"#REF!"},{"$error":"#REF!"}]
[{"$f":"'TD Insumos'!#REF!","v":{"$error":"#REF!"}},null,{"$f":"'TD Insumos'!#REF!","v":{"$error":"#REF!"}},{"$f":"'TD Insumos'!#REF!","v":{"$error":"#REF!"}},{"$f":"'TD Insumos'!#REF!","v":{"$error":"#REF!"}},{"$f":"'TD Insumos'!#REF!","v":{"$error":"#REF!"}},{"$f":"'TD Insumos'!#REF!","v":{"$error":"#REF!"}},{"$f":"'TD Insumos'!#REF!","v":{"$error":"#REF!"}},{"$f":"'TD Insumos'!#REF!","v":{"$error":"#REF!"}},{"$f":"'TD Insumos'!#REF!","v":{"$error":"#REF!"}},{"$error":"#REF!"},{"$error":"#REF!"}]
[{"$f":"'TD Insumos'!#REF!","v":{"$error":"#REF!"}},null,{"$f":"'TD Insumos'!#REF!","v":{"$error":"#REF!"}},{"$f":"'TD Insumos'!#REF!","v":{"$error":"#REF!"}},{"$f":"'TD Insumos'!#REF!","v":{"$error":"#REF!"}},{"$f":"'TD Insumos'!#REF!","v":{"$error":"#REF!"}},{"$f":"'TD Insumos'!#REF!","v":{"$error":"#REF!"}},{"$f":"'TD Insumos'!#REF!","v":{"$error":"#REF!"}},{"$f":"'TD Insumos'!#REF!","v":{"$error":"#REF!"}},{"$f":"'TD Insumos'!#REF!","v":{"$error":"#REF!"}},{"$error":"#REF!"},{"$error":"#REF!"}]
[{"$f":"'TD Insumos'!#REF!","v":{"$error":"#REF!"}},null,{"$f":"'TD Insumos'!#REF!","v":{"$error":"#REF!"}},{"$f":"'TD Insumos'!#REF!","v":{"$error":"#REF!"}},{"$f":"'TD Insumos'!#REF!","v":{"$error":"#REF!"}},{"$f":"'TD Insumos'!#REF!","v":{"$error":"#REF!"}},{"$f":"'TD Insumos'!#REF!","v":{"$error":"#REF!"}},{"$f":"'TD Insumos'!#REF!","v":{"$error":"#REF!"}},{"$f":"'TD Insumos'!#REF!","v":{"$error":"#REF!"}},{"$f":"'TD Insumos'!#REF!","v":{"$error":"#REF!"}},{"$error":"#REF!"},{"$error":"#REF!"}]
[{"$f":"'TD Insumos'!#REF!","v":{"$error":"#REF!"}},null,{"$f":"'TD Insumos'!#REF!","v":{"$error":"#REF!"}},{"$f":"'TD Insumos'!#REF!","v":{"$error":"#REF!"}},{"$f":"'TD Insumos'!#REF!","v":{"$error":"#REF!"}},{"$f":"'TD Insumos'!#REF!","v":{"$error":"#REF!"}},{"$f":"'TD Insumos'!#REF!","v":{"$error":"#REF!"}},{"$f":"'TD Insumos'!#REF!","v":{"$error":"#REF!"}},{"$f":"'TD Insumos'!#REF!","v":{"$error":"#REF!"}},{"$f":"'TD Insumos'!#REF!","v":{"$error":"#REF!"}},{"$error":"#REF!"},{"$error":"#REF!"}]
[{"$f":"'TD Insumos'!#REF!","v":{"$error":"#REF!"}},null,{"$f":"'TD Insumos'!#REF!","v":{"$error":"#REF!"}},{"$f":"'TD Insumos'!#REF!","v":{"$error":"#REF!"}},{"$f":"'TD Insumos'!#REF!","v":{"$error":"#REF!"}},{"$f":"'TD Insumos'!#REF!","v":{"$error":"#REF!"}},{"$f":"'TD Insumos'!#REF!","v":{"$error":"#REF!"}},{"$f":"'TD Insumos'!#REF!","v":{"$error":"#REF!"}},{"$f":"'TD Insumos'!#REF!","v":{"$error":"#REF!"}},{"$f":"'TD Insumos'!#REF!","v":{"$error":"#REF!"}},{"$error":"#REF!"},{"$error":"#REF!"}]
[{"$f":"'TD Insumos'!#REF!","v":{"$error":"#REF!"}},null,{"$f":"'TD Insumos'!#REF!","v":{"$error":"#REF!"}},{"$f":"'TD Insumos'!#REF!","v":{"$error":"#REF!"}},{"$f":"'TD Insumos'!#REF!","v":{"$error":"#REF!"}},{"$f":"'TD Insumos'!#REF!","v":{"$error":"#REF!"}},{"$f":"'TD Insumos'!#REF!","v":{"$error":"#REF!"}},{"$f":"'TD Insumos'!#REF!","v":{"$error":"#REF!"}},{"$f":"'TD Insumos'!#REF!","v":{"$error":"#REF!"}},{"$f":"'TD Insumos'!#REF!","v":{"$error":"#REF!"}},{"$error":"#REF!"},{"$error":"#REF!"}]
[{"$f":"'TD Insumos'!#REF!","v":{"$error":"#REF!"}},null,{"$f":"'TD Insumos'!#REF!","v":{"$error":"#REF!"}},{"$f":"'TD Insumos'!#REF!","v":{"$error":"#REF!"}},{"$f":"'TD Insumos'!#REF!","v":{"$error":"#REF!"}},{"$f":"'TD Insumos'!#REF!","v":{"$error":"#REF!"}},{"$f":"'TD Insumos'!#REF!","v":{"$error":"#REF!"}},{"$f":"'TD Insumos'!#REF!","v":{"$error":"#REF!"}},{"$f":"'TD Insumos'!#REF!","v":{"$error":"#REF!"}},{"$f":"'TD Insumos'!#REF!","v":{"$error":"#REF!"}},{"$error":"#REF!"},{"$error":"#REF!"}]
[{"$f":"'TD Insumos'!#REF!","v":{"$error":"#REF!"}},null,{"$f":"'TD Insumos'!#REF!","v":{"$error":"#REF!"}},{"$f":"'TD Insumos'!#REF!","v":{"$error":"#REF!"}},{"$f":"'TD Insumos'!#REF!","v":{"$error":"#REF!"}},{"$f":"'TD Insumos'!#REF!","v":{"$error":"#REF!"}},{"$f":"'TD Insumos'!#REF!","v":{"$error":"#REF!"}},{"$f":"'TD Insumos'!#REF!","v":{"$error":"#REF!"}},{"$f":"'TD Insumos'!#REF!","v":{"$error":"#REF!"}},{"$f":"'TD Insumos'!#REF!","v":{"$error":"#REF!"}},{"$error":"#REF!"},{"$error":"#REF!"}]
[{"$f":"'TD Insumos'!#REF!","v":{"$error":"#REF!"}},null,{"$f":"'TD Insumos'!#REF!","v":{"$error":"#REF!"}},{"$f":"'TD Insumos'!#REF!","v":{"$error":"#REF!"}},{"$f":"'TD Insumos'!#REF!","v":{"$error":"#REF!"}},{"$f":"'TD Insumos'!#REF!","v":{"$error":"#REF!"}},{"$f":"'TD Insumos'!#REF!","v":{"$error":"#REF!"}},{"$f":"'TD Insumos'!#REF!","v":{"$error":"#REF!"}},{"$f":"'TD Insumos'!#REF!","v":{"$error":"#REF!"}},{"$f":"'TD Insumos'!#REF!","v":{"$error":"#REF!"}},{"$error":"#REF!"},{"$error":"#REF!"}]
[{"$f":"'TD Insumos'!#REF!","v":{"$error":"#REF!"}},null,{"$f":"'TD Insumos'!#REF!","v":{"$error":"#REF!"}},{"$f":"'TD Insumos'!#REF!","v":{"$error":"#REF!"}},{"$f":"'TD Insumos'!#REF!","v":{"$error":"#REF!"}},{"$f":"'TD Insumos'!#REF!","v":{"$error":"#REF!"}},{"$f":"'TD Insumos'!#REF!","v":{"$error":"#REF!"}},{"$f":"'TD Insumos'!#REF!","v":{"$error":"#REF!"}},{"$f":"'TD Insumos'!#REF!","v":{"$error":"#REF!"}},{"$f":"'TD Insumos'!#REF!","v":{"$error":"#REF!"}},{"$error":"#REF!"},{"$error":"#REF!"}]
[{"$f":"'TD Insumos'!#REF!","v":{"$error":"#REF!"}},null,{"$f":"'TD Insumos'!#REF!","v":{"$error":"#REF!"}},{"$f":"'TD Insumos'!#REF!","v":{"$error":"#REF!"}},{"$f":"'TD Insumos'!#REF!","v":{"$error":"#REF!"}},{"$f":"'TD Insumos'!#REF!","v":{"$error":"#REF!"}},{"$f":"'TD Insumos'!#REF!","v":{"$error":"#REF!"}},{"$f":"'TD Insumos'!#REF!","v":{"$error":"#REF!"}},{"$f":"'TD Insumos'!#REF!","v":{"$error":"#REF!"}},{"$f":"'TD Insumos'!#REF!","v":{"$error":"#REF!"}},{"$error":"#REF!"},{"$error":"#REF!"}]
[{"$f":"'TD Insumos'!#REF!","v":{"$error":"#REF!"}},null,{"$f":"'TD Insumos'!#REF!","v":{"$error":"#REF!"}},{"$f":"'TD Insumos'!#REF!","v":{"$error":"#REF!"}},{"$f":"'TD Insumos'!#REF!","v":{"$error":"#REF!"}},{"$f":"'TD Insumos'!#REF!","v":{"$error":"#REF!"}},{"$f":"'TD Insumos'!#REF!","v":{"$error":"#REF!"}},{"$f":"'TD Insumos'!#REF!","v":{"$error":"#REF!"}},{"$f":"'TD Insumos'!#REF!","v":{"$error":"#REF!"}},{"$f":"'TD Insumos'!#REF!","v":{"$error":"#REF!"}},{"$error":"#REF!"},{"$error":"#REF!"}]
[{"$f":"'TD Insumos'!#REF!","v":{"$error":"#REF!"}},null,{"$f":"'TD Insumos'!#REF!","v":{"$error":"#REF!"}},{"$f":"'TD Insumos'!#REF!","v":{"$error":"#REF!"}},{"$f":"'TD Insumos'!#REF!","v":{"$error":"#REF!"}},{"$f":"'TD Insumos'!#REF!","v":{"$error":"#REF!"}},{"$f":"'TD Insumos'!#REF!","v":{"$error":"#REF!"}},{"$f":"'TD Insumos'!#REF!","v":{"$error":"#REF!"}},{"$f":"'TD Insumos'!#REF!","v":{"$error":"#REF!"}},{"$f":"'TD Insumos'!#REF!","v":{"$error":"#REF!"}},{"$error":"#REF!"},{"$error":"#REF!"}]
[{"$f":"'TD Insumos'!#REF!","v":{"$error":"#REF!"}},null,{"$f":"'TD Insumos'!#REF!","v":{"$error":"#REF!"}},{"$f":"'TD Insumos'!#REF!","v":{"$error":"#REF!"}},{"$f":"'TD Insumos'!#REF!","v":{"$error":"#REF!"}},{"$f":"'TD Insumos'!#REF!","v":{"$error":"#REF!"}},{"$f":"'TD Insumos'!#REF!","v":{"$error":"#REF!"}},{"$f":"'TD Insumos'!#REF!","v":{"$error":"#REF!"}},{"$f":"'TD Insumos'!#REF!","v":{"$error":"#REF!"}},{"$f":"'TD Insumos'!#REF!","v":{"$error":"#REF!"}},{"$error":"#REF!"},{"$error":"#REF!"}]
[{"$f":"'TD Insumos'!#REF!","v":{"$error":"#REF!"}},null,{"$f":"'TD Insumos'!#REF!","v":{"$error":"#REF!"}},{"$f":"'TD Insumos'!#REF!","v":{"$error":"#REF!"}},{"$f":"'TD Insumos'!#REF!","v":{"$error":"#REF!"}},{"$f":"'TD Insumos'!#REF!","v":{"$error":"#REF!"}},{"$f":"'TD Insumos'!#REF!","v":{"$error":"#REF!"}},{"$f":"'TD Insumos'!#REF!","v":{"$error":"#REF!"}},{"$f":"'TD Insumos'!#REF!","v":{"$error":"#REF!"}},{"$f":"'TD Insumos'!#REF!","v":{"$error":"#REF!"}},{"$error":"#REF!"},{"$error":"#REF!"}]
["TOTAL ER - ECOLÓGICA",null,null,null,null,{"$f":"SUM(F33:F72)","v":{"$error":"#REF!"}},null,{"$f":"SUM(H33:H72)","v":{"$error":"#REF!"}},null,{"$f":"SUM(J33:J72)","v":{"$error":"#REF!"}},null,{"$f":"SUM(L33:L72)","v":{"$error":"#REF!"}}]

{"sheet":"TDG Insumos","index":37,"n_rows":8,"n_cols":14,"rows_kept":8,"cut":false,"hidden":true,"merged":[]}
[]
[]
[null,"Produtos"]
["Dados",0,"esterco","esterco ","silagem","palha","Palma","palha de milho","ração milho","silo","gliricidea","esterco galinha","esterco ovnos","Total Geral"]
["Estoque período anterior.",0,0,0,3000,0,0,0,0,0,0,0,0,3000]
["Produzido.",0,3585.3,630,0,0,4020,0,0,0,549,0,0,8784.2999999999993]
["Consumido.",0,25.2,0,3000,720,5845,18,300,109.5,0,31.5,31.5,10080.700000000001]
["Estoque final do período.",0,0,0,1800,0,0,0,0,0,0,0,0,1800]